{"text_format":"1","workbook":"xlsx","n_sheets":5,"sheets":["FY22-23 Work Plan","Instructions","Data Validation","Data to Append","Data Validation Instructions"],"not_rendered":{"charts":0,"images":10,"macros":1,"external_links":1,"defined_names":3,"comments":0,"pivot_tables":0},"unopened":[],"bounds":{"document_bytes":16777216,"sheet_cells":100000,"rows_first":2000,"rows_last":500,"rows_between":2000,"halvings":0,"cell_chars":16384,"cell_head_chars":4096},"cells_cut":0,"cells_raw":0,"read":"whole","date_system":"1900"}

{"sheet":"FY22-23 Work Plan","index":0,"n_rows":40,"n_cols":12,"rows_kept":40,"cut":false,"hidden":false,"merged":[[1,0,1,3],[2,0,2,3],[0,0,0,12],[16,0,16,3],[15,0,15,3],[3,0,3,3],[4,0,4,3],[5,0,5,3],[7,0,7,3],[8,0,9,3],[10,0,11,3],[6,0,6,3],[3,4,3,5],[3,7,3,8],[3,9,3,11],[4,4,4,5],[4,7,4,8],[4,9,4,11],[1,4,1,5],[1,7,1,8],[1,9,1,11],[2,4,2,5],[2,7,2,8],[2,9,2,11],[10,9,10,12],[5,4,5,11],[7,4,7,11],[8,7,8,8],[9,7,9,8],[6,4,6,11],[8,4,9,6],[9,9,9,12],[8,9,8,12],[33,3,34,3],[14,7,14,8],[15,7,15,8],[16,7,16,8],[18,7,18,8],[14,0,14,3],[18,0,18,3],[10,7,10,8],[11,7,11,8],[10,4,11,6],[13,0,13,3],[13,4,13,6],[13,7,13,8],[29,1,29,2],[22,3,22,6],[22,7,22,12],[21,7,21,12],[21,3,21,6],[21,0,21,2],[23,3,23,6],[23,7,23,12],[24,3,24,6],[24,7,24,12],[11,9,11,12],[16,9,16,12],[15,9,15,12],[14,9,14,12],[18,4,18,6],[16,4,16,6],[15,4,15,6],[14,4,14,6],[33,9,34,9],[33,4,34,4],[33,7,34,7],[33,8,34,8],[30,3,30,6],[30,7,30,12],[31,3,31,6],[31,7,31,12],[20,0,20,12],[17,0,17,3],[17,4,17,6],[17,7,17,8],[17,9,17,12],[25,3,25,6],[25,7,25,12],[26,3,26,6],[26,7,26,12],[52,5,52,6],[51,5,51,6],[50,5,50,6],[49,5,49,6],[48,5,48,6],[47,5,47,6],[46,5,46,6],[37,5,37,6],[38,5,38,6],[39,5,39,6],[41,5,41,6],[40,5,40,6],[45,5,45,6],[44,5,44,6],[43,5,43,6],[42,5,42,6],[51,11,51,12],[50,11,50,12],[49,11,49,12],[48,11,48,12],[39,11,39,12],[45,11,45,12],[44,11,44,12],[43,11,43,12],[42,11,42,12],[41,11,41,12],[40,11,40,12],[47,11,47,12],[46,11,46,12],[13,9,13,12],[28,0,28,2],[27,0,27,2],[26,0,26,2],[25,0,25,2],[24,0,24,2],[38,11,38,12],[37,11,37,12],[36,11,36,12],[35,11,35,12],[34,11,34,12],[33,5,34,6],[35,5,35,6],[23,0,23,2],[22,0,22,2],[33,0,34,2],[38,0,38,1],[37,0,37,1],[36,0,36,1],[35,0,35,1],[31,1,31,2],[30,1,30,2],[36,5,36,6],[33,10,33,12],[27,3,27,6],[27,7,27,12],[28,3,28,6],[28,7,28,12],[29,3,29,6],[29,7,29,12],[18,9,18,12],[53,0,53,1],[54,0,54,1],[40,0,40,1],[39,0,39,1],[52,0,52,1],[51,0,51,1],[50,0,50,1],[49,0,49,1],[48,0,48,1],[47,0,47,1],[46,0,46,1],[45,0,45,1],[44,0,44,1],[43,0,43,1],[42,0,42,1],[41,0,41,1],[52,11,52,12],[55,0,55,1],[56,0,56,1],[57,0,57,1],[58,0,58,1],[59,0,59,1],[60,0,60,1],[61,0,61,1],[62,0,62,1],[63,0,63,1],[64,0,64,1],[65,0,65,1],[66,0,66,1],[67,0,67,1],[68,0,68,1],[69,0,69,1],[70,0,70,1],[71,0,71,1],[72,0,72,1],[73,0,73,1],[74,0,74,1],[75,0,75,1],[76,0,76,1],[77,0,77,1],[78,0,78,1],[79,0,79,1],[80,0,80,1],[81,0,81,1],[82,0,82,1],[83,0,83,1],[84,0,84,1],[53,5,53,6],[54,5,54,6],[55,5,55,6],[56,5,56,6],[57,5,57,6],[58,5,58,6],[59,5,59,6],[60,5,60,6],[61,5,61,6],[62,5,62,6],[63,5,63,6],[64,5,64,6],[65,5,65,6],[66,5,66,6],[67,5,67,6],[68,5,68,6],[69,5,69,6],[70,5,70,6],[71,5,71,6],[72,5,72,6],[73,5,73,6],[74,5,74,6],[75,5,75,6],[76,5,76,6],[77,5,77,6],[78,5,78,6],[79,5,79,6],[80,5,80,6],[81,5,81,6],[82,5,82,6],[83,5,83,6],[84,5,84,6],[53,11,53,12],[54,11,54,12],[55,11,55,12],[56,11,56,12],[57,11,57,12],[58,11,58,12],[59,11,59,12],[60,11,60,12],[61,11,61,12],[62,11,62,12],[63,11,63,12],[64,11,64,12],[65,11,65,12],[66,11,66,12],[67,11,67,12],[68,11,68,12],[69,11,69,12],[70,11,70,12],[71,11,71,12],[72,11,72,12],[82,11,82,12],[83,11,83,12],[84,11,84,12],[73,11,73,12],[74,11,74,12],[75,11,75,12],[76,11,76,12],[77,11,77,12],[78,11,78,12],[79,11,79,12],[80,11,80,12],[81,11,81,12]]}
["PREVENTION WORK PLAN FY 2022-2023\nSubstance Abuse Prevention and Control - Alcohol and Other Drug Prevention Services "]
["Contractor Name:",null,null,null,"Asian American Drug Abuse Programs, Inc. (AADAP)",null,null,"Contract Type \n(CCP, PEP, Other):",null,"Prevention Education Program (PEP)"]
["Contract Number:",null,null,null,"PH-004367",null,null,"If other contract type, please specify:"]
["Provider ID:",null,null,null,1,null,null,"Evidence Based Program/s Used:",null,"Building Skills"]
["Service Planning Area Served:",null,null,null,"2 - San Fernando Valley",null,null,"Supervisorial District/s Served:",null,"3rd District, 4th District"]
["Cities and Unincorporated Areas* Served:",null,null,null,"Angeles National Forest*, Artesia, Altadena*"]
["If City of LA, list the communities served:",null,null,null,"Cadillac-Corning, Angeles National Forest"]
["Zip Codes Served:",null,null,null,"90032, 90036"]
["Contractor Corporate Address:",null,null,null,"123 E Main St., Suite 100 \nAnytown, CA 90000",null,null,"Phone:",null,9999999999]
[null,null,null,null,null,null,null,"Website:",null,"www.abc1.org"]
["Primary Facilty Site Address:",null,null,null,"123 E Main St., Suite 100 \nAnytown, CA 90000",null,null,"Phone:",null,9999999999]
[null,null,null,null,null,null,null,"Website:",null,"www.abc2.org"]
[]
["Position",null,null,null,"Name",null,null,"Phone",null,"Email"]
["Executive Director:",null,null,null,"John/Jane Doe",null,null,2135551212,null,"janedoe@preventionusa.com"]
["Prevention Program Director:",null,null,null,"John/Jane Doe",null,null,2135551212,null,"janedoe@preventionusa.com"]
["Prevention Program Coordinator:",null,null,null,"John/Jane Doe",null,null,2135551212,null,"j.doe@preventionusa.com"]
["Alternate Contact 1 (or the person required on all communications):",null,null,null,"John/Jane Doe",null,null,2135551213,null,"j.doe@preventionusa.com"]
["Alternate Contact 2 (or the person required on all communications):",null,null,null,"John/Jane Doe",null,null,2135551213,null,"j.doe@preventionusa.com"]
[]
["Social Media Site or Other Online Platform"]
["Platform",null,null,"Name/Handle",null,null,null,"URL"]
["Facebook"]
["Instagram"]
["Podcast"]
["Snapchat"]
["Twitter"]
["TikTok"]
["YouTube"]
["Other:"]
["Other:"]
["Other:"]
[]
["Priority Substance",null,null,"Project Name (EBP/Local Innovative)","Activities","Short-term Outcomes",null,"Long-term Outcomes","Start Date","End Date","Evaluation"]
[null,null,null,null,null,null,null,null,null,null,"Process Measures","Outcome Measures"]
["Alcohol, Marijuana, Methamphetamine, Prescription Drugs",null,null,"PA","Start the PA curriculum at school A","by June, 2023, there will be 25% Increased knowledge on the impact of substance use on health among youth",null,"by June 2025, here will be a 3% reduction in alcohol use among the participating youth","2023-02-01","2023-06-30","Sign in sheets","Pre/post surveys"]
["Prescription Drugs, Marijuana",null,null,"LST","Start LST  curriculum at school B","by June, 2023, there will be 25% Increased knowledge on the impact of substance use on health among youth",null,"by June 2025, here will be a 3% reduction in alcohol use among the participating youth","2023-02-01","2023-06-30","Sign in sheets","Pre/post surveys"]
["Alcohol, Marijuana",null,null,"GGC","Start the GGC curriculum at school C","by June, 2023, there will be 25% Increased knowledge on the impact of substance use on health among youth",null,"by June 2025, here will be a 10% reduction in alcohol use among the participating youth","2023-02-01","2023-06-30","Sign in sheets","Pre/post surveys"]
["Alcohol",null,null,"Retail Engagement / Merchant Committed","Development & Implementation of the Merchant Committed Program at (# of retail) establishments within (specific neighborhood or City) to promote Responsible Beverage Server (RBS) training and create a healthier retail environment. ","by April 30, 2023, there will be 5% reduction in the access and availability of alcohol to youth",null,"by June 2025, here will be a 10% reduction in alcohol use among the participating youth","2022-10-15","2023-04-30","Log of all local outlets contacted and no. of educational materials provided","ABC violations in Alhambra"]
["Methamphetamine",null,null,"Project Meth-1","Provide Meth Prevention Curriculum at local high schools.","By 2022, youth\nresiliency will increase\nby 1% as measured\nby pre/post survey",null,"By 2025, youth\nresiliency will\nincrease by 3% as\nmeasured by\npre/post surveys.","2023-01-01","2023-06-30","Sign in sheets","Pre/post surveys"]

{"sheet":"Instructions","index":1,"n_rows":61,"n_cols":4,"rows_kept":61,"cut":false,"hidden":false,"merged":[[7,1,23,1],[24,1,28,1],[29,1,31,1],[0,1,0,3],[32,1,41,1]]}
[null,"FY 2022-2023 Work Plan Instructions"]
[]
[null,null,"Upon opening the workbook, please ensure to enable macros by clicking on 'Enable Content' when you see the following message.  "]
[]
[]
[]
[null,null,"Data Entry Fields","Instructions/Information"]
[null,"GENERAL INFORMATION","Contractor Name:","Single-select drop-down list. \nName of your agency/organization."]
[null,null,"Contract Number:","Single-select drop-down list."]
[null,null,"Provider ID:","Your 6-digit ID number used for logging into PPSDS."]
[null,null,"Service Planning Area Served:","Single-select drop-down list."]
[null,null,"Contract Type (CCP, PEP, Other):","Single-select drop-down list."]
[null,null,"If other contract type, please specify:","If you selected 'Other' in the field above for Contract Type, then specify your special project or program here."]
[null,null,"Evidence Based Program/s Used:","Multi-select drop-down list. \nNote, this list includes EBPs that are recommended by SAPC on the Prevention Program Manual. If you use an EBP that is not on this list, you may manually type them in the field instead of selecting from the drop-down list."]
[null,null,"Supervisorial District/s Served:","Multi-select drop-down list. "]
[null,null,"Cities and Unincorporated Areas* Served:","Multi-select drop-down list. \nSelections with an asterisk (*) are Unincorporated Areas. "]
[null,null,"If City of LA, list the communities served:","Multi-select drop-down list. \nIf you selected Los Angeles in the field above, indicate the communities within Los Angeles that you serve."]
[null,null,"Zip Codes Served:","Multi-select drop-down list. "]
[null,null,"Contractor Address:","Your main address. "]
[null,null,"Phone:","General phone number for your main address. Enter 10-digits only. Do not include symbols like dashes, periods, or parentheses (e.g., - . ( ))."]
[null,null,"Website:","Main website."]
[null,null,"Address for Additional Location:","Additional/secondary address."]
[null,null,"Phone:","General phone number for your secondary address. Enter 10-digits only. Do not include symbols like dashes, periods, or parentheses (e.g., - . ( ))."]
[null,null,"Website:","Website for additional location. If it's the same as your main website, enter the main website in this field."]
[null,"CONTACTS","Executive Director:","Provide the Name (first and last), Phone, and Email. Enter only 10-digits for phone number."]
[null,null,"Prevention Program Director:","Provide the Name (first and last), Phone, and Email. Enter only 10-digits for phone number."]
[null,null,"Prevention Program Coordinator:","Provide the Name (first and last), Phone, and Email. Enter only 10-digits for phone number."]
[null,null,"Alternate Contact 1 (or the person required on all communications):","If you have additional Prevention Program Coordinators, you may add their contact here. Provide the Name (first and last), Phone, and Email. Enter only 10-digits for phone number."]
[null,null,"Alternate Contact 2 (or the person required on all communications):","If you have additional Prevention Program Coordinators, you may add their contact here. Provide the Name (first and last), Phone, and Email. Enter only 10-digits for phone number."]
[null,"SOCIAL MEDIA","Platform:","Popular platforms have been provided. If you use other platforms that are not listed, type the platform(s) in the field next to where it says 'Other:'."]
[null,null,"Name/Handle:","Provide the Name or Handle of the corresponding platform. E.g, @YourTwitterHandle, @YourFacebookPage, @Your_Instagram, +Your_Google_Name, YourUsername, etc."]
[null,null,"URL:","If applicable, provide the URL of your social media site. "]
[null,"PROJECTS","Priority Substance:","Multi-select drop-down list. \nSelect one or more of the 4 priority substances (alcohol, marijuana, methamphetamine, prescription drugs)."]
[null,null,"Project Name (EBP/Local Innovative):","You may use, but are not limited to, the reccommended EBPs listed in SAPC Prevention Program Manual."]
[null,null,"Activities:","Provide a brief description of activities."]
[null,null,"Short-term Outcomes:","Immediate implementation: measures process change up to 1 year.\nYou may refer to the SAPC Prevention Program Manual or you may develop your own outcomes."]
[null,null,"Long-term Outcomes:","Match the objective to be accomplished within 3-5 years.\nYou may refer to the SAPC Prevention Program Manual or you may develop your own outcomes."]
[null,null,"Start Date:","Enter EXACT project start date in the format, mm/dd/yyyy (may/may not necessarily coincide with the start of FY)."]
[null,null,"End Date:","Enter EXACT project end date in the format, mm/dd/yyyy (may/may not necessarily coincide with the end of FY)."]
[null,null,"Evaluation:","Method(s) you will use to evaluate your project."]
[null,null,"Process Measures:","E.g., sign-in sheets, log of all local outlets contacted, number of educational materials provided, etc."]
[null,null,"Outcome Measures:","E.g., pre/post surveys, ABC violations in service area, etc."]
[]
[null,"Drop-Down List Instructions:"]
[null,"Fields with single-select drop-down lists:"]
[null,"-To open the drop-down list, click on the field/cell, then click on the drop-down arrow located on the bottom right corner of the field. "]
[null,"•","Contractor Name"]
[null,"•","Contract Number"]
[null,"•","Service Planning Area Served"]
[null,"•","Contract Type (CCP, PEP, Other)"]
[null,"Fields with multi-select drop-down lists:"]
[null,"-Select from the drop-down list and repeat to make additional selections."]
[null,"-Additional selections will automatically be added to the field and separated with a comma."]
[null,"-To remove a selection, select the same option again from the drop-down list."]
[null,"-To remove all selections in a field, click on the field/cell and press the 'delete' key."]
[null,"•","Evidence Based Program/s Used"]
[null,"•","Supervisorial District/s Served"]
[null,"•","Cities and Unincorporated Areas* Served"]
[null,"•","If City of LA, list the communities served"]
[null,"•","Zip Codes Served"]
[null,"•","Priority Substance"]

{"sheet":"Data Validation","index":2,"n_rows":313,"n_cols":24,"rows_kept":313,"cut":false,"hidden":true,"merged":[]}
["Contract Type","SPAs","Supervisorial Districts","Priority Substances",null,"Evidence-Based Interventions (Prevention Standards and Practices Manual)",null,"Contractor Name",null,"Contract Number",null,"Area Type","Cities and Unincorporated Areas*",null,"Area Type","Communities within Los Angeles City",null,"Zip Code","Area Name","1st","2nd","3rd","4th","5th"]
["Community Collaboration Program (CCP)","1 - Antelope Valley","1st District","Alcohol",null,"Active Parenting of Teens: Families in Action",null,"Asian American Drug Abuse Programs, Inc. (AADAP)",null,"PH-002749",null,"Unincorporated Area","Acton*",null,"Los Angeles City","Adams-Normandie",null,90001,"Florence-Firestone, South LA (City of LA), City of Huntington Park",null,"X",null,"X"]
["Prevention Education Program (PEP)","2 - San Fernando Valley","2nd District","Marijuana",null,"America on Track",null,"Avalon Carver Community Center",null,"PH-002804",null,"City","Agoura Hills",null,"Los Angeles City","Alsace",null,90002,"Florence-Firestone, Watts (City of LA)",null,"X"]
["Other","3 - San Gabriel Valley","3rd District","Methamphetamine",null,"ATHENA (Athletes Targeting Healthy Exercise & Nutrition Alternatives)",null,"Behavioral Health Services (BHS)",null,"PH-004367",null,"Unincorporated Area","Agua Dulce*",null,"Los Angeles City","Angeles National Forest",null,90003,"South LA (City of LA)",null,"X"]
[null,"4 - Metro","4th District","Prescription Drugs",null,"ATLAS (Athletes Training and Learning to Avoid Steroids)",null,"Behavioral Health Services (BHS) ",null,"PH-004368",null,"City","Alhambra",null,"Los Angeles City","Angelino Heights",null,90004,"Hancock Park/Melrose (City of LA)","X","X","X"]
[null,"5 - West","5th District",null,null,"Building Skills",null,"Cambodian Association of America (CAA)",null,"PH-004369",null,"Unincorporated Area","Altadena*",null,"Los Angeles City","Arleta",null,90005,"Koreatown (City of LA)","X","X"]
[null,"6 - South",null,null,null,"Climate Schools: Alcohol and Cannabis Course",null,"Change Lanes Youth Support Services",null,"PH-004373",null,"Unincorporated Area","Anaverde*",null,"Los Angeles City","Atwater Village",null,90006,"Pico-Union/Koreatown/Harvard Heights (City of LA)","X","X"]
[null,"7 - East",null,null,null,"Communities Mobilizing for Change on Alcohol (CMCA)",null,"Child and Family Service Center",null,"PH-004375",null,"Unincorporated Area","Angeles National Forest*",null,"Los Angeles City","Baldwin Hills",null,90007,"Exposition Park/University Park/West Adams (City of LA)","X","X"]
[null,"8 - South Bay",null,null,null,"Creating Lasting Family Connections (CLFC)/Creating Lasting Connections (CLC)",null,"Children's Hospital Los Angeles (CHLA)",null,"PH-004376",null,"City","Arcadia",null,"Los Angeles City","Bel Air",null,90008,"Baldwin Hills/Leimert Park/Crenshaw (City of LA), Windsor Hills/View Park",null,"X"]
[null,null,null,null,null,"Familias Unidas Preventive Intervention",null,"Community Coalition for Substance Abuse & Treatment (CoCo)",null,"PH-004377",null,"Unincorporated Area","Arcadia Unincorporated*",null,"Los Angeles City","Beverly Crest",null,90010,"Koreatown/Little Bangladesh/Wilshire Center (City of LA)",null,"X"]
[null,null,null,null,null,"Guiding Good Choices (GGC)",null,"Day One",null,"PH-004381",null,"City","Artesia",null,"Los Angeles City","Beverlywood",null,90011,"Central LA/South Park (City of LA)","X","X"]
[null,null,null,null,null,"I Can Problem Solve (ICPS)",null,"HealthRIGHT 360 - Prototypes",null,"PH-004383",null,"Unincorporated Area","Athens Village*",null,"Los Angeles City","Boyle Heights",null,90012,"Downtown/Chinatown/Little Tokyo/Elysian Park (City of LA)","X"]
[null,null,null,null,null,"Keep A Clear Mind (KACM)",null,"Helpline Youth Counseling (HYC)",null,"PH-004388",null,"Unincorporated Area","Athens-Westmont*",null,"Los Angeles City","Brentwood",null,90013,"Downtown/Little Tokyo/Wholesale District (City of LA)","X"]
[null,null,null,null,null,"Keepin' it REAL",null,"Institute for Public Strategies (IPS)",null,"PH-004389",null,"City","Avalon",null,"Los Angeles City","Brookside",null,90014,"Downtown/Wholesale District (City of LA)","X"]
[null,null,null,null,null,"LifeSkills Training (LST)*",null,"Korean American Family Services, Inc.",null,"PH-004391",null,"Unincorporated Area","Avocado Heights*",null,"Los Angeles City","Cadillac-Corning",null,90015,"Downtown/Pico-Union/Wholesale District (City of LA)","X","X"]
[null,null,null,null,null,"Media Ready",null,"Koreatown Youth & Community Center (KYCC)",null,"PH-004393",null,"City","Azusa",null,"Los Angeles City","Canoga Park",null,90016,"Alsace/Baldwin Hills/Crenshaw/Cloverdale-Cochran (City of LA)",null,"X"]
[null,null,null,null,null,"Nurturing Parenting Programs",null,"Los Angeles County Office of Education (LACOE)",null,"PH-004394",null,"Unincorporated Area","Azusa Unincorporated*",null,"Los Angeles City","Carthay",null,90017,"Downtown/Westlake (City of LA)","X"]
[null,null,null,null,null,"Positive Action",null,"NCADD-East San Gabriel & Pomona Valleys (ESGPV)",null,"PH-004396",null,"City","Baldwin Park",null,"Los Angeles City","Central",null,90018,"West Adams/Jefferson Park/Exposition Park (City of LA)",null,"X"]
[null,null,null,null,null,"Prevention through Alternative Learning Styles (PALS)",null,"NCADD-San Fernando Valley (SFV)",null,"PH-004398",null,"Unincorporated Area","Bassett*",null,"Los Angeles City","Century City",null,90019,"Mid City/Miracle Mile/Country Club Park/Victoria Park (City of LA)",null,"X"]
[null,null,null,null,null,"Project Alert",null,"Pacific Clinics",null,"PH-004399",null,"City","Bell",null,"Los Angeles City","Century Palms/Cove",null,90020,"Hancock Park/Little Bangladesh/Wilshire Center (City of LA)","X","X"]
[null,null,null,null,null,"Project MAGIC (Making A Group and Individual Commitment)",null,"Parents Anonymous, Inc.",null,"PH-004400",null,"City","Bell Gardens",null,"Los Angeles City","Cheviot Hills",null,90021,"Wholesale District/Arts District (City of LA)","X"]
[null,null,null,null,null,"Project Northland",null,"People Coordinated Services (PCS)",null,"PH-004401",null,"City","Bellflower",null,"Los Angeles City","Chinatown",null,90022,"East Los Angeles, City of Commerce","X",null,null,"X"]
[null,null,null,null,null,"Project Towards No Drug Abuse",null,"Phoenix Houses of Los Angeles, Inc.",null,"PH-004402",null,"City","Beverly Hills",null,"Los Angeles City","Cloverdale/Cochran",null,90023,"East Los Angeles, Boyle Heights (City of LA)","X",null,null,"X"]
[null,null,null,null,null,"SAFEChildren",null,"Pueblo Y Salud",null,"PH-004403",null,"Unincorporated Area","Bouquet Canyon*",null,"Los Angeles City","Country Club Park",null,90024,"Westwood (City of LA)",null,null,"X"]
[null,null,null,null,null,"Say It Straight (SIS)",null,"Social Model Recovery Systems (SMRS)",null,"PH-004404",null,"City","Bradbury",null,"Los Angeles City","Crenshaw District",null,90025,"Sawtelle/West Los Angeles/Century City (City of LA)",null,null,"X"]
[null,null,null,null,null,"Storytelling for Empowerment",null,"South Central Prevention Coalition (SCPC)",null,"PH-004407",null,"Unincorporated Area","Bradbury*",null,"Los Angeles City","Crestview",null,90026,"Echo Park/Silverlake/Historic Filipinotown/Angelino Heights (City of LA)","X"]
[null,null,null,null,null,"Strengthening Families Program (SPF)*",null,"Special Services for Groups",null,"PH-004408",null,"City","Burbank",null,"Los Angeles City","Del Rey",null,90027,"Los Feliz/Silverlake/Thai Town (City of LA)","X",null,"X",null,"X"]
[null,null,null,null,null,"Strengthening Families Program: For Parents and Youth 10-14",null,"Tarzana Treatment Centers (TTC)",null,"PH-004409",null,"City","Calabasas",null,"Los Angeles City","Downtown",null,90028,"Hollywood (City of LA)",null,null,"X",null,"X"]
[null,null,null,null,null,"Strong African American Families (SAAF)",null,"The Wall Las Memorias Project (TWLMP)",null,"PH-004412",null,"Unincorporated Area","Canyon Country Unincorporated*",null,"Los Angeles City","Eagle Rock",null,90029,"East Hollywood/Little Armenia/Silverlake/Melrose (City of LA)","X",null,"X"]
[null,null,null,null,null,null,null,"Watts Healthcare Corporation",null,"PH-004413",null,"City","Carson",null,"Los Angeles City","East Hollywood",null,90031,"Lincoln Heights/Elysian Valley/Montecito Heights (City of LA)","X"]
[null,null,null,null,null,null,null,null,null,"PH-004416",null,"Unincorporated Area","Castaic*",null,"Los Angeles City","Echo Park",null,90032,"El Sereno/Cal State University LA/Monterey Hills (City of LA)","X",null,null,null,"X"]
[null,null,null,null,null,null,null,null,null,null,null,"City","Cerritos",null,"Los Angeles City","El Sereno",null,90033,"Boyle Heights/Wholesale District (City of LA)","X"]
[null,null,null,null,null,null,null,null,null,null,null,"Unincorporated Area","City Terrace*",null,"Los Angeles City","Elysian Park",null,90034,"Palms/Beverlywood (City of LA)",null,"X","X"]
[null,null,null,null,null,null,null,null,null,null,null,"City","Claremont",null,"Los Angeles City","Elysian Valley",null,90035,"Crestview/South Carthay/Beverlywood (City of LA)",null,"X","X"]
[null,null,null,null,null,null,null,null,null,null,null,"City","Commerce, City of",null,"Los Angeles City","Encino",null,90036,"Melrose/Park La Brea/Miracle Mile/Hancock Park (City of LA)",null,"X","X"]
[null,null,null,null,null,null,null,null,null,null,null,"City","Compton",null,"Los Angeles City","Exposition",null,90037,"South LA/Exposition Park/South Park (City of LA)",null,"X"]
[null,null,null,null,null,null,null,null,null,null,null,"City","Covina",null,"Los Angeles City","Exposition Park",null,90038,"Melrose/Hollywood (City of LA)",null,null,"X"]
[null,null,null,null,null,null,null,null,null,null,null,"Unincorporated Area","Covina (Charter Oak)*",null,"Los Angeles City","Faircrest Heights",null,90039,"Atwater Village/Silverlake/Echo Park (City of LA)","X",null,null,null,"X"]
[null,null,null,null,null,null,null,null,null,null,null,"Unincorporated Area","Covina Unincorporated*",null,"Los Angeles City","Figueroa Park Square",null,90040,"City of Commerce","X",null,null,"X"]
[null,null,null,null,null,null,null,null,null,null,null,"City","Cudahy",null,"Los Angeles City","Florence-Firestone",null,90041,"Eagle Rock (City of LA)","X",null,null,null,"X"]
[null,null,null,null,null,null,null,null,null,null,null,"City","Culver City",null,"Los Angeles City","Glassell Park",null,90042,"Highland Park/Eagle Rock (City of LA)","X",null,null,null,"X"]
[null,null,null,null,null,null,null,null,null,null,null,"Unincorporated Area","Del Sur*",null,"Los Angeles City","Gramercy Place",null,90043,"View Park/Windsor Hills, Hyde Park/Leimert Park (City of LA)",null,"X"]
[null,null,null,null,null,null,null,null,null,null,null,"Unincorporated Area","Desert View Highlands*",null,"Los Angeles City","Granada Hills",null,90044,"Athens-Westmont, South LA/Harvard Heights (City of LA)",null,"X"]
[null,null,null,null,null,null,null,null,null,null,null,"City","Diamond Bar",null,"Los Angeles City","Green Meadows",null,90045,"Westchester/LAX (City of LA)",null,"X"]
[null,null,null,null,null,null,null,null,null,null,null,"City","Downey",null,"Los Angeles City","Hancock Park",null,90046,"City of West Hollywood, Hollywood/Hollywood Hills/Fairfax/Melrose (City of LA)",null,null,"X",null,"X"]
[null,null,null,null,null,null,null,null,null,null,null,"City","Duarte",null,"Los Angeles City","Harbor City",null,90047,"Athens-Westmont, South LA/Harvard Heights/Manchester Square (City of LA)",null,"X"]
[null,null,null,null,null,null,null,null,null,null,null,"Unincorporated Area","Duarte Unincorporated*",null,"Los Angeles City","Harbor Gateway",null,90048,"Fairfax/Carthay/Beverly (City of LA), City of West Hollywood",null,"X","X"]
[null,null,null,null,null,null,null,null,null,null,null,"Unincorporated Area","East La Mirada*",null,"Los Angeles City","Harbor Pines",null,90049,"Bel Air/Brentwood/Westwood (City of LA)",null,null,"X"]
[null,null,null,null,null,null,null,null,null,null,null,"Unincorporated Area","East Los Angeles*",null,"Los Angeles City","Harvard Heights",null,90056,"Ladera Heights",null,"X"]
[null,null,null,null,null,null,null,null,null,null,null,"Unincorporated Area","East Rancho Dominguez*",null,"Los Angeles City","Harvard Park",null,90057,"Westlake/Temple-Beaudry (City of LA)","X","X"]
[null,null,null,null,null,null,null,null,null,null,null,"Unincorporated Area","East Whittier*",null,"Los Angeles City","Highland Park",null,90058,"City of Vernon, Central LA (City of LA), Bandini Islands","X","X",null,"X"]
[null,null,null,null,null,null,null,null,null,null,null,"City","El Monte",null,"Los Angeles City","Historic Filipinotown",null,90059,"Watts (City of LA), Willowbrook, City of Compton",null,"X",null,"X"]
[null,null,null,null,null,null,null,null,null,null,null,"City","El Segundo",null,"Los Angeles City","Hollywood",null,90061,"Willowbrook, Athens Village, South LA (City of LA)",null,"X"]
[null,null,null,null,null,null,null,null,null,null,null,"Unincorporated Area","Florence-Firestone*",null,"Los Angeles City","Hollywood Hills",null,90062,"Exposition Park/South LA (City of LA)",null,"X"]
[null,null,null,null,null,null,null,null,null,null,null,"City","Gardena",null,"Los Angeles City","Hyde Park",null,90063,"East Los Angeles, Boyle Heights (City of LA)","X"]
[null,null,null,null,null,null,null,null,null,null,null,"City","Glendale",null,"Los Angeles City","Jefferson Park",null,90064,"Cheviot Hills/Rancho Park/Century City/Mar Vista (City of LA)",null,null,"X"]
[null,null,null,null,null,null,null,null,null,null,null,"City","Glendora",null,"Los Angeles City","Koreatown",null,90065,"Glassell Park/Mt. Washington/Cypress Park (City of LA)","X",null,null,null,"X"]
[null,null,null,null,null,null,null,null,null,null,null,"Unincorporated Area","Gorman*",null,"Los Angeles City","Lafayette Square",null,90066,"Mar Vista/Del Rey/Playa Vista (City of LA), City of Culver City",null,"X","X"]
[null,null,null,null,null,null,null,null,null,null,null,"Unincorporated Area","Hacienda Heights*",null,"Los Angeles City","Lake Balboa",null,90067,"Century City (City of LA)",null,null,"X"]
[null,null,null,null,null,null,null,null,null,null,null,"City","Hawaiian Gardens",null,"Los Angeles City","Lakeview Terrace",null,90068,"Hollywood Hills/Los Feliz (City of LA)",null,null,"X",null,"X"]
[null,null,null,null,null,null,null,null,null,null,null,"City","Hawthorne",null,"Los Angeles City","Leimert Park",null,90069,"City of West Hollywood, Hollywood (City of LA)",null,null,"X"]
[null,null,null,null,null,null,null,null,null,null,null,"City","Hermosa Beach",null,"Los Angeles City","Lincoln Heights",null,90071,"Downtown (City of LA)","X"]
[null,null,null,null,null,null,null,null,null,null,null,"City","Hidden Hills",null,"Los Angeles City","Little Armenia",null,90073,"VA Hospital (Unincorporated)",null,null,"X"]
[null,null,null,null,null,null,null,null,null,null,null,"City","Huntington Park",null,"Los Angeles City","Little Bangladesh",null,90077,"Bel Air/Beverly Crest (City of LA)",null,null,"X"]
[null,null,null,null,null,null,null,null,null,null,null,"City","Industry, City of",null,"Los Angeles City","Little Tokyo",null,90089,"USC (City of LA)",null,"X"]
[null,null,null,null,null,null,null,null,null,null,null,"City","Inglewood",null,"Los Angeles City","Longwood",null,90090,"Dodger Stadium (City of LA)","X"]
[null,null,null,null,null,null,null,null,null,null,null,"City","Irwindale",null,"Los Angeles City","Los Feliz",null,90094,"Playa Vista/Playa Del Rey (City of LA)",null,"X"]
[null,null,null,null,null,null,null,null,null,null,null,"Unincorporated Area","Kagel/Lopez Canyons*",null,"Los Angeles City","Manchester Square",null,90095,"UCLA (City of LA)",null,null,"X"]
[null,null,null,null,null,null,null,null,null,null,null,"City","La Cañada Flintridge",null,"Los Angeles City","Mandeville Canyon",null,90201,"City of Bell, City of Bell Gardens, City of Cudahy",null,null,null,"X"]
[null,null,null,null,null,null,null,null,null,null,null,"Unincorporated Area","La Crescenta-Montrose*",null,"Los Angeles City","Mar Vista",null,90210,"City of Beverly Hills/Beverly Crest (City of LA)",null,null,"X"]
[null,null,null,null,null,null,null,null,null,null,null,"City","La Habra Heights",null,"Los Angeles City","Marina Peninsula",null,90211,"City of Beverly Hills",null,null,"X"]
[null,null,null,null,null,null,null,null,null,null,null,"City","La Mirada",null,"Los Angeles City","Melrose",null,90212,"City of Beverly Hills",null,null,"X"]
[null,null,null,null,null,null,null,null,null,null,null,"City","La Puente",null,"Los Angeles City","Mid-City",null,90220,"City of Compton, West Rancho Dominguez",null,"X"]
[null,null,null,null,null,null,null,null,null,null,null,"Unincorporated Area","La Rambla*",null,"Los Angeles City","Miracle Mile",null,90221,"City of Compton, East Rancho Dominguez",null,"X",null,"X"]
[null,null,null,null,null,null,null,null,null,null,null,"City","La Verne",null,"Los Angeles City","Mission Hills",null,90222,"City of Compton, Rosewood, Willowbrook",null,"X",null,"X"]
[null,null,null,null,null,null,null,null,null,null,null,"Unincorporated Area","La Verne Unincorporated*",null,"Los Angeles City","Mt. Washington",null,90230,"City of Culver City, Ladera Heights, Playa Vista/Del Rey (City of LA)",null,"X"]
[null,null,null,null,null,null,null,null,null,null,null,"Unincorporated Area","Ladera Heights*",null,"Los Angeles City","North Hollywood",null,90232,"City of Culver City, Palms (City of LA)",null,"X","X"]
[null,null,null,null,null,null,null,null,null,null,null,"Unincorporated Area","Lake Hughes*",null,"Los Angeles City","Northridge",null,90240,"City of Downey",null,null,null,"X"]
[null,null,null,null,null,null,null,null,null,null,null,"Unincorporated Area","Lake Los Angeles*",null,"Los Angeles City","Pacific Palisades",null,90241,"City of Downey",null,null,null,"X"]
[null,null,null,null,null,null,null,null,null,null,null,"Unincorporated Area","Lake Manor*",null,"Los Angeles City","Pacoima",null,90242,"City of Downey",null,null,null,"X"]
[null,null,null,null,null,null,null,null,null,null,null,"City","Lakewood",null,"Los Angeles City","Palisades Highlands",null,90245,"City of El Segundo",null,"X"]
[null,null,null,null,null,null,null,null,null,null,null,"City","Lancaster",null,"Los Angeles City","Palms",null,90247,"City of Gardena, Harbor Gateway (City of LA)",null,"X",null,"X"]
[null,null,null,null,null,null,null,null,null,null,null,"City","Lawndale",null,"Los Angeles City","Panorama City",null,90248,"City of Gardena, Harbor Gateway (City of LA), City of Carson, Rosewood",null,"X",null,"X"]
[null,null,null,null,null,null,null,null,null,null,null,"Unincorporated Area","Lennox*",null,"Los Angeles City","Park La Brea",null,90249,"City of Gardena, El Camino Village",null,"X"]
[null,null,null,null,null,null,null,null,null,null,null,"Unincorporated Area","Leona Valley*",null,"Los Angeles City","Pico-Union",null,90250,"City of Hawthorne, Del Aire, Wiseburn, Unincorporated Hawthorne",null,"X"]
[null,null,null,null,null,null,null,null,null,null,null,"Unincorporated Area","Littlerock*",null,"Los Angeles City","Playa Del Rey",null,90254,"City of Hermosa Beach",null,"X"]
[null,null,null,null,null,null,null,null,null,null,null,"Unincorporated Area","Littlerock/Juniper Hills*",null,"Los Angeles City","Porter Ranch",null,90255,"City of Huntington Park, Walnut Park",null,"X",null,"X"]
[null,null,null,null,null,null,null,null,null,null,null,"Unincorporated Area","Littlerock/Pearblossom*",null,"Los Angeles City","Rancho Park",null,90260,"City of Lawndale, El Camino Village, City of Hawthorne",null,"X"]
[null,null,null,null,null,null,null,null,null,null,null,"Unincorporated Area","Llano*",null,"Los Angeles City","Regent Square",null,90261,"City of Hawthorne",null,"X"]
[null,null,null,null,null,null,null,null,null,null,null,"City","Lomita",null,"Los Angeles City","Reseda",null,90262,"City of Lynwood",null,"X",null,"X"]
[null,null,null,null,null,null,null,null,null,null,null,"City","Long Beach",null,"Los Angeles City","Reseda Ranch",null,90263,"Pepperdine University (Unincorporated Santa Monica Mountains)",null,null,"X"]
[null,null,null,null,null,null,null,null,null,null,null,"City","Los Angeles",null,"Los Angeles City","Reynier Village",null,90265,"City of Malibu, Santa Monica Mountains",null,null,"X"]
[null,null,null,null,null,null,null,null,null,null,null,"Unincorporated Area","Los Nietos*",null,"Los Angeles City","San Pedro",null,90266,"City of Manhattan Beach",null,"X"]
[null,null,null,null,null,null,null,null,null,null,null,"City","Lynwood",null,"Los Angeles City","Shadow Hills",null,90270,"City of Maywood",null,null,null,"X"]
[null,null,null,null,null,null,null,null,null,null,null,"City","Malibu",null,"Los Angeles City","Sherman Oaks",null,90272,"Pacific Palisades/Palisades Highlands (City of LA)",null,null,"X"]
[null,null,null,null,null,null,null,null,null,null,null,"City","Manhattan Beach",null,"Los Angeles City","Silverlake",null,90274,"City of Palos Verdes Estates, City of Rolling Hills, City of Rolling Hills Estates, Westfield/Academy Hills",null,null,null,"X"]
[null,null,null,null,null,null,null,null,null,null,null,"Unincorporated Area","Marina del Rey*",null,"Los Angeles City","South Carthay",null,90275,"City of Rancho Palos Verdes",null,null,null,"X"]
[null,null,null,null,null,null,null,null,null,null,null,"City","Maywood",null,"Los Angeles City","South Park",null,90277,"City of Redondo Beach, City of Torrance",null,"X",null,"X"]
[null,null,null,null,null,null,null,null,null,null,null,"City","Monrovia",null,"Los Angeles City","St. Elmo Village",null,90278,"City of Redondo Beach, City of Torrance",null,"X",null,"X"]
[null,null,null,null,null,null,null,null,null,null,null,"Unincorporated Area","Monrovia Unincorporated*",null,"Los Angeles City","Studio City",null,90280,"City of South Gate",null,"X",null,"X"]
[null,null,null,null,null,null,null,null,null,null,null,"City","Montebello",null,"Los Angeles City","Sun Valley",null,90290,"Topanga (Santa Monica Mountains)",null,null,"X"]
[null,null,null,null,null,null,null,null,null,null,null,"City","Monterey Park",null,"Los Angeles City","Sunland",null,90291,"Venice (City of LA)",null,"X","X"]
[null,null,null,null,null,null,null,null,null,null,null,"Unincorporated Area","North Whittier*",null,"Los Angeles City","Sycamore Square",null,90292,"Marina del Rey, Del Rey (City of L A)",null,"X","X"]
[null,null,null,null,null,null,null,null,null,null,null,"Unincorporated Area","Northeast San Gabriel*",null,"Los Angeles City","Sylmar",null,90293,"Playa del Rey (City of LA)",null,"X"]
[null,null,null,null,null,null,null,null,null,null,null,"City","Norwalk",null,"Los Angeles City","Tarzana",null,90301,"City of Inglewood",null,"X"]
[null,null,null,null,null,null,null,null,null,null,null,"City","Palmdale",null,"Los Angeles City","Temple-Beaudry",null,90302,"City of Inglewood",null,"X"]
[null,null,null,null,null,null,null,null,null,null,null,"Unincorporated Area","Palmdale Unincorporated*",null,"Los Angeles City","Thai Town",null,90303,"City of Inglewood",null,"X"]
[null,null,null,null,null,null,null,null,null,null,null,"City","Palos Verdes Estates",null,"Los Angeles City","Toluca Lake",null,90304,"Lennox, City of Inglewood, City of Hawthorne",null,"X"]
[null,null,null,null,null,null,null,null,null,null,null,"City","Paramount",null,"Los Angeles City","Toluca Terrace",null,90305,"City of Inglewood",null,"X"]
[null,null,null,null,null,null,null,null,null,null,null,"City","Pasadena",null,"Los Angeles City","Toluca Woods",null,90401,"City of Santa Monica",null,null,"X"]
[null,null,null,null,null,null,null,null,null,null,null,"Unincorporated Area","Pearblossom/Llano*",null,"Los Angeles City","Tujunga",null,90402,"City of Santa Monica, Pacific Palisades (City of LA)",null,null,"X"]
[null,null,null,null,null,null,null,null,null,null,null,"City","Pico Rivera",null,"Los Angeles City","University Hills",null,90403,"City of Santa Monica",null,null,"X"]
[null,null,null,null,null,null,null,null,null,null,null,"City","Pomona",null,"Los Angeles City","University Park",null,90404,"City of Santa Monica",null,null,"X"]
[null,null,null,null,null,null,null,null,null,null,null,"Unincorporated Area","Quartz Hill*",null,"Los Angeles City","Valley Glen",null,90405,"City of Santa Monica",null,null,"X"]
[null,null,null,null,null,null,null,null,null,null,null,"Unincorporated Area","Rancho Dominguez*",null,"Los Angeles City","Valley Village",null,90501,"City of Torrance, Harbor Gateway (City of LA)",null,"X",null,"X"]
[null,null,null,null,null,null,null,null,null,null,null,"City","Rancho Palos Verdes",null,"Los Angeles City","Van Nuys",null,90502,"West Carson, Harbor Gateway (City of LA)",null,"X"]
[null,null,null,null,null,null,null,null,null,null,null,"City","Redondo Beach",null,"Los Angeles City","Venice",null,90503,"City of Torrance",null,null,null,"X"]
[null,null,null,null,null,null,null,null,null,null,null,"City","Rolling Hills",null,"Los Angeles City","Vermont Knolls",null,90504,"City of Torrance",null,"X",null,"X"]
[null,null,null,null,null,null,null,null,null,null,null,"City","Rolling Hills Estates",null,"Los Angeles City","Vermont Square",null,90505,"City of Torrance",null,null,null,"X"]
[null,null,null,null,null,null,null,null,null,null,null,"City","Rosemead",null,"Los Angeles City","Vermont Vista",null,90506,"El Camino College (Unincorporated El Camino Village)",null,"X"]
[null,null,null,null,null,null,null,null,null,null,null,"Unincorporated Area","Rosewood*",null,"Los Angeles City","Vernon Central",null,90601,"City of Whittier, Unincorporated Whittier, City of Industry, City of Pico Rivera, Sunrise Village","X",null,null,"X"]
[null,null,null,null,null,null,null,null,null,null,null,"Unincorporated Area","Rosewood/West Rancho Dominguez*",null,"Los Angeles City","Victoria Park",null,90602,"City of Whittier",null,null,null,"X"]
[null,null,null,null,null,null,null,null,null,null,null,"Unincorporated Area","Rowland Heights*",null,"Los Angeles City","View Heights",null,90603,"City of Whittier",null,null,null,"X"]
[null,null,null,null,null,null,null,null,null,null,null,"City","San Dimas",null,"Los Angeles City","Watts",null,90604,"South Whittier, East Whittier, City of Whittier, East La Mirada",null,null,null,"X"]
[null,null,null,null,null,null,null,null,null,null,null,"City","San Fernando",null,"Los Angeles City","Wellington Square",null,90605,"City of Whittier, South Whittier",null,null,null,"X"]
[null,null,null,null,null,null,null,null,null,null,null,"City","San Gabriel",null,"Los Angeles City","West Adams",null,90606,"West Whittier/Los Nietos, City of Whittier, City of Santa Fe Springs",null,null,null,"X"]
[null,null,null,null,null,null,null,null,null,null,null,"Unincorporated Area","San Jose Hills*",null,"Los Angeles City","West Hills",null,90623,"City of Cerritos",null,null,null,"X"]
[null,null,null,null,null,null,null,null,null,null,null,"City","San Marino",null,"Los Angeles City","West Los Angeles",null,90630,"Unincorporated Lakewood",null,null,null,"X"]
[null,null,null,null,null,null,null,null,null,null,null,"Unincorporated Area","Santa Catalina Island*",null,"Los Angeles City","West Vernon",null,90631,"City of La Habra Heights, Rowland Heights, Unincorporated La Habra Heights","X",null,null,"X"]
[null,null,null,null,null,null,null,null,null,null,null,"City","Santa Clarita",null,"Los Angeles City","Westchester",null,90638,"City of La Mirada",null,null,null,"X"]
[null,null,null,null,null,null,null,null,null,null,null,"City","Santa Fe Springs",null,"Los Angeles City","Westlake",null,90639,"Biola University (City of La Mirada)",null,null,null,"X"]
[null,null,null,null,null,null,null,null,null,null,null,"City","Santa Monica",null,"Los Angeles City","Westwood",null,90640,"City of Montebello","X",null,null,"X"]
[null,null,null,null,null,null,null,null,null,null,null,"Unincorporated Area","Santa Monica Mountains*",null,"Los Angeles City","Wilmington",null,90650,"City of Norwalk",null,null,null,"X"]
[null,null,null,null,null,null,null,null,null,null,null,"Unincorporated Area","Saugus Unincorporated*",null,"Los Angeles City","Wilshire Center",null,90660,"City of Pico Rivera, Whittier Narrows","X",null,null,"X"]
[null,null,null,null,null,null,null,null,null,null,null,"City","Sierra Madre",null,"Los Angeles City","Winnetka",null,90670,"City of Santa Fe Springs",null,null,null,"X"]
[null,null,null,null,null,null,null,null,null,null,null,"City","Signal Hill",null,"Los Angeles City","Woodland Hills",null,90701,"City of Artesia",null,null,null,"X"]
[null,null,null,null,null,null,null,null,null,null,null,"City","South El Monte",null,null,null,null,90703,"City of Cerritos, Unincorporated Cerritos",null,null,null,"X"]
[null,null,null,null,null,null,null,null,null,null,null,"Unincorporated Area","South El Monte Unincorporated*",null,null,null,null,90704,"City of Avalon, Unincorporated Santa Catalina Island",null,null,null,"X"]
[null,null,null,null,null,null,null,null,null,null,null,"City","South Gate",null,null,null,null,90706,"City of Bellflower",null,null,null,"X"]
[null,null,null,null,null,null,null,null,null,null,null,"City","South Pasadena",null,null,null,null,90710,"Harbor City (City of LA), West Carson",null,"X",null,"X"]
[null,null,null,null,null,null,null,null,null,null,null,"Unincorporated Area","South San Gabriel*",null,null,null,null,90712,"City of Lakewood",null,null,null,"X"]
[null,null,null,null,null,null,null,null,null,null,null,"Unincorporated Area","South Whittier*",null,null,null,null,90713,"City of Lakewood",null,null,null,"X"]
[null,null,null,null,null,null,null,null,null,null,null,"Unincorporated Area","Stevenson Ranch*",null,null,null,null,90715,"City of Lakewood",null,null,null,"X"]
[null,null,null,null,null,null,null,null,null,null,null,"Unincorporated Area","Sun Village*",null,null,null,null,90716,"City of Hawaiian Gardens",null,null,null,"X"]
[null,null,null,null,null,null,null,null,null,null,null,"Unincorporated Area","Sunrise Village*",null,null,null,null,90717,"City of Lomita, Harbor City (City of LA),",null,null,null,"X"]
[null,null,null,null,null,null,null,null,null,null,null,"City","Temple City",null,null,null,null,90723,"City of Paramount",null,"X",null,"X"]
[null,null,null,null,null,null,null,null,null,null,null,"City","Torrance",null,null,null,null,90731,"San Pedro/Harbor City/Terminal Island (City of LA), La Rambla",null,null,null,"X"]
[null,null,null,null,null,null,null,null,null,null,null,"Unincorporated Area","Twin Lakes/Oat Mountain*",null,null,null,null,90732,"San Pedro/Harbor City (City of LA), La Rambla, City of Rancho Palos Verdes",null,null,null,"X"]
[null,null,null,null,null,null,null,null,null,null,null,"Unincorporated Area","Val Verde*",null,null,null,null,90744,"Wilmington/Harbor City (City of LA)",null,"X",null,"X"]
[null,null,null,null,null,null,null,null,null,null,null,"Unincorporated Area","Valencia Unincorporated*",null,null,null,null,90745,"City of Carson",null,"X",null,"X"]
[null,null,null,null,null,null,null,null,null,null,null,"Unincorporated Area","Valinda*",null,null,null,null,90746,"City of Carson",null,"X"]
[null,null,null,null,null,null,null,null,null,null,null,"City","Vernon",null,null,null,null,90747,"Cal State University Dominguez Hills (City of Carson)",null,"X"]
[null,null,null,null,null,null,null,null,null,null,null,"Unincorporated Area","View Park/Windsor Hills*",null,null,null,null,90755,"City of Signal Hill",null,null,null,"X"]
[null,null,null,null,null,null,null,null,null,null,null,"City","Walnut",null,null,null,null,90802,"City of Long Beach",null,null,null,"X"]
[null,null,null,null,null,null,null,null,null,null,null,"Unincorporated Area","Walnut Park*",null,null,null,null,90803,"City of Long Beach",null,null,null,"X"]
[null,null,null,null,null,null,null,null,null,null,null,"Unincorporated Area","West Antelope Valley*",null,null,null,null,90804,"City of Long Beach",null,null,null,"X"]
[null,null,null,null,null,null,null,null,null,null,null,"Unincorporated Area","West Carson*",null,null,null,null,90805,"City of Long Beach",null,"X",null,"X"]
[null,null,null,null,null,null,null,null,null,null,null,"City","West Covina",null,null,null,null,90806,"City of Long Beach",null,null,null,"X"]
[null,null,null,null,null,null,null,null,null,null,null,"City","West Hollywood",null,null,null,null,90807,"City of Long Beach",null,null,null,"X"]
[null,null,null,null,null,null,null,null,null,null,null,"Unincorporated Area","West LA Unincorporated*",null,null,null,null,90808,"City of Long Beach, Unincorporated Long Beach",null,null,null,"X"]
[null,null,null,null,null,null,null,null,null,null,null,"Unincorporated Area","West Puente Valley*",null,null,null,null,90810,"City of Long Beach, City of Carson",null,"X",null,"X"]
[null,null,null,null,null,null,null,null,null,null,null,"Unincorporated Area","West Rancho Dominguez*",null,null,null,null,90813,"City of Long Beach",null,null,null,"X"]
[null,null,null,null,null,null,null,null,null,null,null,"Unincorporated Area","West Whittier/Los Nietos*",null,null,null,null,90814,"City of Long Beach",null,null,null,"X"]
[null,null,null,null,null,null,null,null,null,null,null,"City","Westlake Village",null,null,null,null,90815,"City of Long Beach",null,null,null,"X"]
[null,null,null,null,null,null,null,null,null,null,null,"Unincorporated Area","White Fence Farms*",null,null,null,null,90822,"VA Medical Center-Long Beach (City of Long Beach)",null,null,null,"X"]
[null,null,null,null,null,null,null,null,null,null,null,"City","Whittier",null,null,null,null,90831,"World Trade Center (City of Long Beach)",null,null,null,"X"]
[null,null,null,null,null,null,null,null,null,null,null,"Unincorporated Area","Whittier Narrows*",null,null,null,null,90840,"Cal State University Long Beach (City of Long Beach)",null,null,null,"X"]
[null,null,null,null,null,null,null,null,null,null,null,"Unincorporated Area","Whittier Unincorporated*",null,null,null,null,90846,"City of Long Beach, City of Lakewood",null,null,null,"X"]
[null,null,null,null,null,null,null,null,null,null,null,"Unincorporated Area","Willowbrook*",null,null,null,null,91001,"Altadena",null,null,null,null,"X"]
[null,null,null,null,null,null,null,null,null,null,null,"Unincorporated Area","Wiseburn*",null,null,null,null,91006,"City of Arcadia, Unincorporated Arcadia","X",null,null,null,"X"]
[null,null,null,null,null,null,null,null,null,null,null,null,null,null,null,null,null,91007,"City of Arcadia, Unincorporated NE San Gabriel",null,null,null,null,"X"]
[null,null,null,null,null,null,null,null,null,null,null,null,null,null,null,null,null,91008,"City of Bradbury, Unincorporated Bradbury, City of Duarte",null,null,null,null,"X"]
[null,null,null,null,null,null,null,null,null,null,null,null,null,null,null,null,null,91010,"City of Duarte, Unincorporated Duarte, City of Azusa, City of Irwindale","X",null,null,null,"X"]
[null,null,null,null,null,null,null,null,null,null,null,null,null,null,null,null,null,91011,"City of La Canada-Flintridge, City of Pasadena",null,null,null,null,"X"]
[null,null,null,null,null,null,null,null,null,null,null,null,null,null,null,null,null,91016,"City of Monrovia, Unincorporated Monrovia","X",null,null,null,"X"]
[null,null,null,null,null,null,null,null,null,null,null,null,null,null,null,null,null,91020,"La Crescenta-Montrose, City of Glendale",null,null,null,null,"X"]
[null,null,null,null,null,null,null,null,null,null,null,null,null,null,null,null,null,91023,"Mount Wilson (Angeles National Forest)",null,null,null,null,"X"]
[null,null,null,null,null,null,null,null,null,null,null,null,null,null,null,null,null,91024,"City of Sierra Madre",null,null,null,null,"X"]
[null,null,null,null,null,null,null,null,null,null,null,null,null,null,null,null,null,91030,"City of South Pasadena","X",null,null,null,"X"]
[null,null,null,null,null,null,null,null,null,null,null,null,null,null,null,null,null,91040,"Shadow Hills/Sunland/Hansen Dam (City of LA)",null,null,"X",null,"X"]
[null,null,null,null,null,null,null,null,null,null,null,null,null,null,null,null,null,91042,"Tujunga (City of LA), Angeles National Forest",null,null,null,null,"X"]
[null,null,null,null,null,null,null,null,null,null,null,null,null,null,null,null,null,91046,"City of Glendale (Verdugo City)",null,null,null,null,"X"]
[null,null,null,null,null,null,null,null,null,null,null,null,null,null,null,null,null,91101,"City of Pasadena",null,null,null,null,"X"]
[null,null,null,null,null,null,null,null,null,null,null,null,null,null,null,null,null,91103,"City of Pasadena",null,null,null,null,"X"]
[null,null,null,null,null,null,null,null,null,null,null,null,null,null,null,null,null,91104,"City of Pasadena, Altadena",null,null,null,null,"X"]
[null,null,null,null,null,null,null,null,null,null,null,null,null,null,null,null,null,91105,"City of Pasadena","X",null,null,null,"X"]
[null,null,null,null,null,null,null,null,null,null,null,null,null,null,null,null,null,91106,"City of Pasadena",null,null,null,null,"X"]
[null,null,null,null,null,null,null,null,null,null,null,null,null,null,null,null,null,91107,"City of Pasadena, Unincorporated East Pasadena, San Pasqual, Kinneloa Mesa",null,null,null,null,"X"]
[null,null,null,null,null,null,null,null,null,null,null,null,null,null,null,null,null,91108,"City of San Marino",null,null,null,null,"X"]
[null,null,null,null,null,null,null,null,null,null,null,null,null,null,null,null,null,91125,"California Institute of Technology (City of Pasadena)",null,null,null,null,"X"]
[null,null,null,null,null,null,null,null,null,null,null,null,null,null,null,null,null,91126,"California Institute of Technology (City of Pasadena)",null,null,null,null,"X"]
[null,null,null,null,null,null,null,null,null,null,null,null,null,null,null,null,null,91201,"City of Glendale",null,null,null,null,"X"]
[null,null,null,null,null,null,null,null,null,null,null,null,null,null,null,null,null,91202,"City of Glendale",null,null,null,null,"X"]
[null,null,null,null,null,null,null,null,null,null,null,null,null,null,null,null,null,91203,"City of Glendale",null,null,null,null,"X"]
[null,null,null,null,null,null,null,null,null,null,null,null,null,null,null,null,null,91204,"City of Glendale","X",null,null,null,"X"]
[null,null,null,null,null,null,null,null,null,null,null,null,null,null,null,null,null,91205,"City of Glendale, Glassell Park (City of LA)","X",null,null,null,"X"]
[null,null,null,null,null,null,null,null,null,null,null,null,null,null,null,null,null,91206,"City of Glendale","X",null,null,null,"X"]
[null,null,null,null,null,null,null,null,null,null,null,null,null,null,null,null,null,91207,"City of Glendale",null,null,null,null,"X"]
[null,null,null,null,null,null,null,null,null,null,null,null,null,null,null,null,null,91208,"City of Glendale",null,null,null,null,"X"]
[null,null,null,null,null,null,null,null,null,null,null,null,null,null,null,null,null,91210,"Glendale Galleria (City of Glendale)",null,null,null,null,"X"]
[null,null,null,null,null,null,null,null,null,null,null,null,null,null,null,null,null,91214,"La Crescenta-Montrose, City of Glendale",null,null,null,null,"X"]
[null,null,null,null,null,null,null,null,null,null,null,null,null,null,null,null,null,91301,"City of Agoura Hills, Santa Monica Mountains",null,null,"X"]
[null,null,null,null,null,null,null,null,null,null,null,null,null,null,null,null,null,91302,"City of Calabasas, City of Hidden Hills, Santa Monica Mountains",null,null,"X"]
[null,null,null,null,null,null,null,null,null,null,null,null,null,null,null,null,null,91303,"Canoga Park (City of LA)",null,null,"X"]
[null,null,null,null,null,null,null,null,null,null,null,null,null,null,null,null,null,91304,"Canoga Park/West Hills (City of LA), West Chatsworth, Lake Manor",null,null,"X"]
[null,null,null,null,null,null,null,null,null,null,null,null,null,null,null,null,null,91306,"Winnetka (City of LA)",null,null,"X"]
[null,null,null,null,null,null,null,null,null,null,null,null,null,null,null,null,null,91307,"West Hills (City of LA), Unincorporated Westhills",null,null,"X"]
[null,null,null,null,null,null,null,null,null,null,null,null,null,null,null,null,null,91311,"Chatsworth (City of LA), Twin Lakes, Oat Mountain",null,null,"X",null,"X"]
[null,null,null,null,null,null,null,null,null,null,null,null,null,null,null,null,null,91316,"Encino (City of LA)",null,null,"X"]
[null,null,null,null,null,null,null,null,null,null,null,null,null,null,null,null,null,91321,"City of Santa Clarita, Unincorporated Newhall, Placerita Canyon, Angeles National Forest",null,null,null,null,"X"]
[null,null,null,null,null,null,null,null,null,null,null,null,null,null,null,null,null,91324,"Northridge (City of LA)",null,null,"X"]
[null,null,null,null,null,null,null,null,null,null,null,null,null,null,null,null,null,91325,"Northridge (City of LA)",null,null,"X"]
[null,null,null,null,null,null,null,null,null,null,null,null,null,null,null,null,null,91326,"Porter Ranch (City of LA), Twin Lakes, Oat Mountain",null,null,"X",null,"X"]
[null,null,null,null,null,null,null,null,null,null,null,null,null,null,null,null,null,91330,"California State University Northridge (City of LA)",null,null,"X"]
[null,null,null,null,null,null,null,null,null,null,null,null,null,null,null,null,null,91331,"Arleta/Pacoima (City of LA)",null,null,"X",null,"X"]
[null,null,null,null,null,null,null,null,null,null,null,null,null,null,null,null,null,91335,"Reseda (City of LA)",null,null,"X"]
[null,null,null,null,null,null,null,null,null,null,null,null,null,null,null,null,null,91340,"City of San Fernando, Mission Hills/Pacoima (City of LA)",null,null,"X"]
[null,null,null,null,null,null,null,null,null,null,null,null,null,null,null,null,null,91342,"Lake View Terrace/Sylmar (City of LA), Kagel Canyon, Lopez Canyon",null,null,"X",null,"X"]
[null,null,null,null,null,null,null,null,null,null,null,null,null,null,null,null,null,91343,"North Hills/Northridge (City of LA)",null,null,"X"]
[null,null,null,null,null,null,null,null,null,null,null,null,null,null,null,null,null,91344,"Granada Hills (City of LA)",null,null,"X"]
[null,null,null,null,null,null,null,null,null,null,null,null,null,null,null,null,null,91345,"Mission Hills (City of LA)",null,null,"X"]
[null,null,null,null,null,null,null,null,null,null,null,null,null,null,null,null,null,91350,"City of Santa Clarita",null,null,null,null,"X"]
[null,null,null,null,null,null,null,null,null,null,null,null,null,null,null,null,null,91351,"City of Santa Clarita",null,null,null,null,"X"]
[null,null,null,null,null,null,null,null,null,null,null,null,null,null,null,null,null,91352,"Sun Valley (City of LA)",null,null,"X",null,"X"]
[null,null,null,null,null,null,null,null,null,null,null,null,null,null,null,null,null,91354,"City of Santa Clarita, Unincorporated Santa Clarita Valley",null,null,null,null,"X"]
[null,null,null,null,null,null,null,null,null,null,null,null,null,null,null,null,null,91355,"City of Santa Clarita, Stevenson Ranch, Val Verde",null,null,null,null,"X"]
[null,null,null,null,null,null,null,null,null,null,null,null,null,null,null,null,null,91356,"Tarzana/Encino (City of LA)",null,null,"X"]
[null,null,null,null,null,null,null,null,null,null,null,null,null,null,null,null,null,91361,"City of Westlake Village, Santa Monica Mountains",null,null,"X"]
[null,null,null,null,null,null,null,null,null,null,null,null,null,null,null,null,null,91362,"City of Westlake Village",null,null,"X"]
[null,null,null,null,null,null,null,null,null,null,null,null,null,null,null,null,null,91364,"Woodland Hills (City of LA), Santa Monica Mountains",null,null,"X"]
[null,null,null,null,null,null,null,null,null,null,null,null,null,null,null,null,null,91367,"Woodland Hills (City of LA)",null,null,"X"]
[null,null,null,null,null,null,null,null,null,null,null,null,null,null,null,null,null,91381,"Stevenson Ranch",null,null,null,null,"X"]
[null,null,null,null,null,null,null,null,null,null,null,null,null,null,null,null,null,91382,"Unincorporated Santa Clarita Valley, Twin Lakes, Oat Mountain",null,null,null,null,"X"]
[null,null,null,null,null,null,null,null,null,null,null,null,null,null,null,null,null,91384,"Castaic, Val Verde",null,null,null,null,"X"]
[null,null,null,null,null,null,null,null,null,null,null,null,null,null,null,null,null,91387,"City of Santa Clarita, Unincorporated Santa Clarita Valley, Agua Dulce, Angeles National Forest",null,null,null,null,"X"]
[null,null,null,null,null,null,null,null,null,null,null,null,null,null,null,null,null,91390,"Acton, Agua Dulce, City of Santa Clarita, Boquet Canyon, San Francisquito Canyon,",null,null,null,null,"X"]
[null,null,null,null,null,null,null,null,null,null,null,null,null,null,null,null,null,91401,"Valley Glen/Sherman Oaks/Van Nuys (City of LA)",null,null,"X"]
[null,null,null,null,null,null,null,null,null,null,null,null,null,null,null,null,null,91402,"Panorama City (City of LA)",null,null,"X"]
[null,null,null,null,null,null,null,null,null,null,null,null,null,null,null,null,null,91403,"Sherman Oaks/Encino (City of LA)",null,null,"X"]
[null,null,null,null,null,null,null,null,null,null,null,null,null,null,null,null,null,91405,"Van Nuys (City of LA)",null,null,"X"]
[null,null,null,null,null,null,null,null,null,null,null,null,null,null,null,null,null,91406,"Van Nuys/Lake Balboa (City of LA)",null,null,"X"]
[null,null,null,null,null,null,null,null,null,null,null,null,null,null,null,null,null,91411,"Van Nuys/Sherman Oaks (City of LA)",null,null,"X"]
[null,null,null,null,null,null,null,null,null,null,null,null,null,null,null,null,null,91423,"Sherman Oaks (City of LA)",null,null,"X"]
[null,null,null,null,null,null,null,null,null,null,null,null,null,null,null,null,null,91436,"Encino (City of LA)",null,null,"X"]
[null,null,null,null,null,null,null,null,null,null,null,null,null,null,null,null,null,91501,"City of Burbank",null,null,null,null,"X"]
[null,null,null,null,null,null,null,null,null,null,null,null,null,null,null,null,null,91502,"City of Burbank",null,null,null,null,"X"]
[null,null,null,null,null,null,null,null,null,null,null,null,null,null,null,null,null,91504,"City of Burbank, Sun Valley (City of LA)",null,null,null,null,"X"]
[null,null,null,null,null,null,null,null,null,null,null,null,null,null,null,null,null,91505,"City of Burbank",null,null,"X",null,"X"]
[null,null,null,null,null,null,null,null,null,null,null,null,null,null,null,null,null,91506,"City of Burbank",null,null,null,null,"X"]
[null,null,null,null,null,null,null,null,null,null,null,null,null,null,null,null,null,91521,"City of Burbank (Disney Studios)",null,null,null,null,"X"]
[null,null,null,null,null,null,null,null,null,null,null,null,null,null,null,null,null,91522,"City of Burbank (Warner Brothers Studios)",null,null,null,null,"X"]
[null,null,null,null,null,null,null,null,null,null,null,null,null,null,null,null,null,91523,"City of Burbank",null,null,null,null,"X"]
[null,null,null,null,null,null,null,null,null,null,null,null,null,null,null,null,null,91601,"North Hollywood/Toluca Terrace/Toluca Woods/Valley Village (City of LA)",null,null,null,null,"X"]
[null,null,null,null,null,null,null,null,null,null,null,null,null,null,null,null,null,91602,"North Hollywood/Toluca Lake/Studio City (City of LA)",null,null,null,null,"X"]
[null,null,null,null,null,null,null,null,null,null,null,null,null,null,null,null,null,91604,"Studio City/Sherman Oaks (City of LA)",null,null,"X",null,"X"]
[null,null,null,null,null,null,null,null,null,null,null,null,null,null,null,null,null,91605,"North Hollywood (City of LA)",null,null,"X",null,"X"]
[null,null,null,null,null,null,null,null,null,null,null,null,null,null,null,null,null,91606,"North Hollywood (City of LA)",null,null,"X",null,"X"]
[null,null,null,null,null,null,null,null,null,null,null,null,null,null,null,null,null,91607,"North Hollywood/Valley Village/Sherman Oaks (City of LA)",null,null,"X",null,"X"]
[null,null,null,null,null,null,null,null,null,null,null,null,null,null,null,null,null,91608,"Universal City",null,null,null,null,"X"]
[null,null,null,null,null,null,null,null,null,null,null,null,null,null,null,null,null,91702,"City of Azusa, Unincorporated Azusa, Angeles National Forest","X",null,null,null,"X"]
[null,null,null,null,null,null,null,null,null,null,null,null,null,null,null,null,null,91706,"City of Baldwin Park, City of Irwindale","X",null,null,null,"X"]
[null,null,null,null,null,null,null,null,null,null,null,null,null,null,null,null,null,91709,"City of Pomona","X"]
[null,null,null,null,null,null,null,null,null,null,null,null,null,null,null,null,null,91710,"City of Pomona","X"]
[null,null,null,null,null,null,null,null,null,null,null,null,null,null,null,null,null,91711,"City of Claremont, Unincorporated Claremont, Padua Hills, Unincorporated La Verne","X",null,null,null,"X"]
[null,null,null,null,null,null,null,null,null,null,null,null,null,null,null,null,null,91722,"City of Covina, Unincorporated Covina, Charter Oak","X",null,null,null,"X"]
[null,null,null,null,null,null,null,null,null,null,null,null,null,null,null,null,null,91723,"City of Covina, Unincorporated Covina","X"]
[null,null,null,null,null,null,null,null,null,null,null,null,null,null,null,null,null,91724,"City of Covina, Unincorporated Covina, Charter Oak","X",null,null,null,"X"]
[null,null,null,null,null,null,null,null,null,null,null,null,null,null,null,null,null,91731,"City of El Monte","X",null,null,null,"X"]
[null,null,null,null,null,null,null,null,null,null,null,null,null,null,null,null,null,91732,"City of El Monte","X"]
[null,null,null,null,null,null,null,null,null,null,null,null,null,null,null,null,null,91733,"City of South El Monte, City of El Monte, Whittier Narrows","X"]
[null,null,null,null,null,null,null,null,null,null,null,null,null,null,null,null,null,91740,"City of Glendora, Unincorporated Glendora","X",null,null,null,"X"]
[null,null,null,null,null,null,null,null,null,null,null,null,null,null,null,null,null,91741,"City of Glendora, City of San Dimas, Angeles National Forest",null,null,null,null,"X"]
[null,null,null,null,null,null,null,null,null,null,null,null,null,null,null,null,null,91744,"City of La Puente, Valinda, San Jose Hills, City of Industry, West Puente Valley","X"]
[null,null,null,null,null,null,null,null,null,null,null,null,null,null,null,null,null,91745,"Hacienda Heights, City of Industry","X",null,null,"X"]
[null,null,null,null,null,null,null,null,null,null,null,null,null,null,null,null,null,91746,"Avocado Heights, Bassett, City of Industry, City of La Puente, North Whittier","X"]
[null,null,null,null,null,null,null,null,null,null,null,null,null,null,null,null,null,91748,"Rowland Heights, City of Industry","X"]
[null,null,null,null,null,null,null,null,null,null,null,null,null,null,null,null,null,91750,"City of La Verne, Unincorporated La Verne, Angeles National Forest","X",null,null,null,"X"]
[null,null,null,null,null,null,null,null,null,null,null,null,null,null,null,null,null,91754,"City of Monterey Park","X"]
[null,null,null,null,null,null,null,null,null,null,null,null,null,null,null,null,null,91755,"City of Monterey Park","X"]
[null,null,null,null,null,null,null,null,null,null,null,null,null,null,null,null,null,91759,"Unincorporated Mt. Baldy, Angeles National Forest",null,null,null,null,"X"]
[null,null,null,null,null,null,null,null,null,null,null,null,null,null,null,null,null,91765,"City of Diamond Bar","X"]
[null,null,null,null,null,null,null,null,null,null,null,null,null,null,null,null,null,91766,"City of Pomona","X"]
[null,null,null,null,null,null,null,null,null,null,null,null,null,null,null,null,null,91767,"City of Pomona","X",null,null,null,"X"]
[null,null,null,null,null,null,null,null,null,null,null,null,null,null,null,null,null,91768,"City of Pomona, Unincorporated Pomona (Cal Poly Pomona)","X",null,null,null,"X"]
[null,null,null,null,null,null,null,null,null,null,null,null,null,null,null,null,null,91770,"City of Rosemead, South San Gabriel","X",null,null,null,"X"]
[null,null,null,null,null,null,null,null,null,null,null,null,null,null,null,null,null,91773,"City of San Dimas, Unincorporated San Dimas","X",null,null,null,"X"]
[null,null,null,null,null,null,null,null,null,null,null,null,null,null,null,null,null,91775,"City of San Gabriel, Unincorporated NE San Gabriel, City of Temple City","X",null,null,null,"X"]
[null,null,null,null,null,null,null,null,null,null,null,null,null,null,null,null,null,91776,"City of San Gabriel, Unincorporated NE San Gabriel","X",null,null,null,"X"]
[null,null,null,null,null,null,null,null,null,null,null,null,null,null,null,null,null,91780,"City of Temple City, Unincorporated Arcadia","X",null,null,null,"X"]
[null,null,null,null,null,null,null,null,null,null,null,null,null,null,null,null,null,91789,"City of Walnut, Rowland Heights, City of Diamond Bar, City of Industry, Unincorporated Walnut, City of Pomona","X"]
[null,null,null,null,null,null,null,null,null,null,null,null,null,null,null,null,null,91790,"City of West Covina","X"]
[null,null,null,null,null,null,null,null,null,null,null,null,null,null,null,null,null,91791,"City of West Covina, Valinda","X"]
[null,null,null,null,null,null,null,null,null,null,null,null,null,null,null,null,null,91792,"City of West Covina, San Jose Hills","X"]
[null,null,null,null,null,null,null,null,null,null,null,null,null,null,null,null,null,91801,"City of Alhambra","X",null,null,null,"X"]
[null,null,null,null,null,null,null,null,null,null,null,null,null,null,null,null,null,91803,"City of Alhambra","X"]
[null,null,null,null,null,null,null,null,null,null,null,null,null,null,null,null,null,92397,"Wrightwood",null,null,null,null,"X"]
[null,null,null,null,null,null,null,null,null,null,null,null,null,null,null,null,null,92821,"Rowland Heights","X"]
[null,null,null,null,null,null,null,null,null,null,null,null,null,null,null,null,null,92823,"Unincorporated Diamond Bar","X"]
[null,null,null,null,null,null,null,null,null,null,null,null,null,null,null,null,null,93243,"Unincorporated West Antelope Valley, Gorman",null,null,null,null,"X"]
[null,null,null,null,null,null,null,null,null,null,null,null,null,null,null,null,null,93510,"Acton",null,null,null,null,"X"]
[null,null,null,null,null,null,null,null,null,null,null,null,null,null,null,null,null,93523,"South Edwards/Edwards AFB",null,null,null,null,"X"]
[null,null,null,null,null,null,null,null,null,null,null,null,null,null,null,null,null,93532,"Lake Hughes, Elizabeth Lake",null,null,null,null,"X"]
[null,null,null,null,null,null,null,null,null,null,null,null,null,null,null,null,null,93534,"City of Lancaster, Unincorporated North Lancaster",null,null,null,null,"X"]
[null,null,null,null,null,null,null,null,null,null,null,null,null,null,null,null,null,93535,"City of Lancaster, Hi Vista, Roosevelt, Lake Los Angeles, Unincorporated North Lancaster",null,null,null,null,"X"]
[null,null,null,null,null,null,null,null,null,null,null,null,null,null,null,null,null,93536,"City of Lancaster, Quartz Hill, Del Sur, West Antelope Valley",null,null,null,null,"X"]
[null,null,null,null,null,null,null,null,null,null,null,null,null,null,null,null,null,93543,"Littlerock, Sun Village, Juniper Hills",null,null,null,null,"X"]
[null,null,null,null,null,null,null,null,null,null,null,null,null,null,null,null,null,93544,"Llano, Pearblossom",null,null,null,null,"X"]
[null,null,null,null,null,null,null,null,null,null,null,null,null,null,null,null,null,93550,"City of Palmdale, Unincorporated Palmdale, South Antelope Valley, Angeles National Forest",null,null,null,null,"X"]
[null,null,null,null,null,null,null,null,null,null,null,null,null,null,null,null,null,93551,"City of Palmdale, Leona Valley, Desert View Highlands, White Fence Farms, Anaverde",null,null,null,null,"X"]
[null,null,null,null,null,null,null,null,null,null,null,null,null,null,null,null,null,93552,"City of Palmdale, Unincorporated Palmdale, South Antelope Valley, Angeles National Forest",null,null,null,null,"X"]
[null,null,null,null,null,null,null,null,null,null,null,null,null,null,null,null,null,93553,"Pearblossom, Longview, Juniper Hills, Angeles National Forest",null,null,null,null,"X"]
[null,null,null,null,null,null,null,null,null,null,null,null,null,null,null,null,null,93563,"Valyermo, Llano, Angeles National Forest",null,null,null,null,"X"]
[null,null,null,null,null,null,null,null,null,null,null,null,null,null,null,null,null,93591,"Lake Los Angeles, Unincorporated Palmdale, Sun Village, Hi Vista, City of Palmdale",null,null,null,null,"X"]

{"sheet":"Data to Append","index":3,"n_rows":51,"n_cols":64,"rows_kept":51,"cut":false,"hidden":true,"merged":[]}
["CONTRACTOR NAME","CONTRACT TYPE (PEP, CCP, Other)","Other Contract Type","CONTRACT NUMBER","PROVIDER ID","Evidence Based Program/s Used","Service Planning Area/s Served","Supervisiorial District/s Served","Cities and Unincorporated Areas* Served","If City of LA, list the communities served","Zip Codes Served","CONTRACTOR ADDRESS","Phone","Website","Address for Additional Location","Phone2","Website2","Executive Director Name","Executive Director Phone","Executive Director Email","Prevention Program Director Name","Prevention Program Director Phone","Prevention Program Director Email","Prevention Program Coordinator Name","Prevention Program Coordinator Phone","Prevention Program Coordinator Email","Alternate Contact 1 (or the person required on all communications) Name","Alternate Contact 1 (or the person required on all communications) Phone","Alternate Contact 1 (or the person required on all communications) Email","Alternate Contact 2 (or the person required on all communications) Name","Alternate Contact 2 (or the person required on all communications) Phone","Alternate Contact 2 (or the person required on all communications) Email","Facebook Name/Handle","Facebook URL","Instagram Name/Handle","Instagram URL","Podcast Name/Handle","Podcast URL","Snapchat Name/Handle","Snapchat URL","Twitter Name/Handle","Twitter URL","TikTok Name/Handle","TikTok URL","YouTube Name/Handle","YouTube URL","Other 1 Platform","Other 1 Name/Handle","Other 1 URL","Other 2 Platform","Other 2 Name/Handle","Other 2 URL","Other 3 Platform","Other 3 Name/Handle","Other 3 URL","Priority Substance","Project Name (EBP/Local Innovative)","Activities","Short-Term Outcomes","Long-Term Outcomes","Start Date","End Date","Process Measures","Outcome Measures"]
[{"$f":"IF(ISBLANK('FY22-23 Work Plan'!$E$2:$E$2),\"\",'FY22-23 Work Plan'!$E$2:$E$2)","v":"Asian American Drug Abuse Programs, Inc. (AADAP)"},{"$f":"IF(ISBLANK('FY22-23 Work Plan'!$J$2:$J$2),\"\",'FY22-23 Work Plan'!$J$2:$J$2)","v":"Prevention Education Program (PEP)"},{"$f":"IF(ISBLANK('FY22-23 Work Plan'!$J$3:$J$3),\"\",'FY22-23 Work Plan'!$J$3:$J$3)","v":""},{"$f":"IF(ISBLANK('FY22-23 Work Plan'!$E$3:$E$3),\"\",'FY22-23 Work Plan'!$E$3:$E$3)","v":"PH-004367"},{"$f":"IF(ISBLANK('FY22-23 Work Plan'!$E$4:$E$4),\"\",TEXT('FY22-23 Work Plan'!$E$4:$E$4,\"000000\"))","v":"000001"},{"$f":"IF(ISBLANK('FY22-23 Work Plan'!$J$4:$J$4),\"\",'FY22-23 Work Plan'!$J$4:$J$4)","v":"Building Skills"},{"$f":"IF(ISBLANK('FY22-23 Work Plan'!$E$5:$E$5),\"\",'FY22-23 Work Plan'!$E$5:$E$5)","v":"2 - San Fernando Valley"},{"$f":"IF(ISBLANK('FY22-23 Work Plan'!$J$5:$J$5),\"\",'FY22-23 Work Plan'!$J$5:$J$5)","v":"3rd District, 4th District"},{"$f":"IF(ISBLANK('FY22-23 Work Plan'!$E$6:$E$6),\"\",'FY22-23 Work Plan'!$E$6:$E$6)","v":"Angeles National Forest*, Artesia, Altadena*"},{"$f":"IF(ISBLANK('FY22-23 Work Plan'!$E$7:$E$7),\"\",'FY22-23 Work Plan'!$E$7:$E$7)","v":"Cadillac-Corning, Angeles National Forest"},{"$f":"IF(ISBLANK('FY22-23 Work Plan'!$E$8:$E$8),\"\",'FY22-23 Work Plan'!$E$8:$E$8)","v":"90032, 90036"},{"$f":"IF(ISBLANK('FY22-23 Work Plan'!$E$9:$E$9),\"\",'FY22-23 Work Plan'!$E$9:$E$9)","v":"123 E Main St., Suite 100 \nAnytown, CA 90000"},{"$f":"IF(ISBLANK('FY22-23 Work Plan'!$J$9:$J$9),\"\",TEXT('FY22-23 Work Plan'!$J$9:$J$9,\"###-###-####\"))","v":"999-999-9999"},{"$f":"IF(ISBLANK('FY22-23 Work Plan'!$J$10:$J$10),\"\",'FY22-23 Work Plan'!$J$10:$J$10)","v":"www.abc1.org"},{"$f":"IF(ISBLANK('FY22-23 Work Plan'!$E$11:$E$11),\"\",'FY22-23 Work Plan'!$E$11:$E$11)","v":"123 E Main St., Suite 100 \nAnytown, CA 90000"},{"$f":"IF(ISBLANK('FY22-23 Work Plan'!$J$11:$J$11),\"\",TEXT('FY22-23 Work Plan'!$J$11:$J$11,\"###-###-####\"))","v":"999-999-9999"},{"$f":"IF(ISBLANK('FY22-23 Work Plan'!$J$12:$J$12),\"\",'FY22-23 Work Plan'!$J$12:$J$12)","v":"www.abc2.org"},{"$f":"IF(ISBLANK('FY22-23 Work Plan'!$E$15:$E$15),\"\",'FY22-23 Work Plan'!$E$15:$E$15)","v":"John/Jane Doe"},{"$f":"IF(ISBLANK('FY22-23 Work Plan'!$H$15:$H$15),\"\",TEXT('FY22-23 Work Plan'!$H$15:$H$15,\"###-###-####\"))","v":"213-555-1212"},{"$f":"IF(ISBLANK('FY22-23 Work Plan'!$J$15:$J$15),\"\",'FY22-23 Work Plan'!$J$15:$J$15)","v":"janedoe@preventionusa.com"},{"$f":"IF(ISBLANK('FY22-23 Work Plan'!$E$16:$E$16),\"\",'FY22-23 Work Plan'!$E$16:$E$16)","v":"John/Jane Doe"},{"$f":"IF(ISBLANK('FY22-23 Work Plan'!$H$16:$H$16),\"\",TEXT('FY22-23 Work Plan'!$H$16:$H$16,\"###-###-####\"))","v":"213-555-1212"},{"$f":"IF(ISBLANK('FY22-23 Work Plan'!$J$16:$J$16),\"\",'FY22-23 Work Plan'!$J$16:$J$16)","v":"janedoe@preventionusa.com"},{"$f":"IF(ISBLANK('FY22-23 Work Plan'!$E$17:$E$17),\"\",'FY22-23 Work Plan'!$E$17:$E$17)","v":"John/Jane Doe"},{"$f":"IF(ISBLANK('FY22-23 Work Plan'!$H$17:$H$17),\"\",TEXT('FY22-23 Work Plan'!$H$17:$H$17,\"###-###-####\"))","v":"213-555-1212"},{"$f":"IF(ISBLANK('FY22-23 Work Plan'!$J$17:$J$17),\"\",'FY22-23 Work Plan'!$J$17:$J$17)","v":"j.doe@preventionusa.com"},{"$f":"IF(ISBLANK('FY22-23 Work Plan'!$E$18:$E$18),\"\",'FY22-23 Work Plan'!$E$18:$E$18)","v":"John/Jane Doe"},{"$f":"IF(ISBLANK('FY22-23 Work Plan'!$H$18:$H$18),\"\",TEXT('FY22-23 Work Plan'!$H$18:$H$18,\"###-###-####\"))","v":"213-555-1213"},{"$f":"IF(ISBLANK('FY22-23 Work Plan'!$J$18:$J$18),\"\",'FY22-23 Work Plan'!$J$18:$J$18)","v":"j.doe@preventionusa.com"},{"$f":"IF(ISBLANK('FY22-23 Work Plan'!$E$19:$E$19),\"\",'FY22-23 Work Plan'!$E$19:$E$19)","v":"John/Jane Doe"},{"$f":"IF(ISBLANK('FY22-23 Work Plan'!$H$19:$H$19),\"\",TEXT('FY22-23 Work Plan'!$H$19:$H$19,\"###-###-####\"))","v":"213-555-1213"},{"$f":"IF(ISBLANK('FY22-23 Work Plan'!$J$19:$J$19),\"\",'FY22-23 Work Plan'!$J$19:$J$19)","v":"j.doe@preventionusa.com"},{"$f":"IF(ISBLANK('FY22-23 Work Plan'!$D$23:$D$23),\"\",'FY22-23 Work Plan'!$D$23:$D$23)","v":""},{"$f":"IF(ISBLANK('FY22-23 Work Plan'!$H$23:$H$23),\"\",'FY22-23 Work Plan'!$H$23:$H$23)","v":""},{"$f":"IF(ISBLANK('FY22-23 Work Plan'!$D$24:$D$24),\"\",'FY22-23 Work Plan'!$D$24:$D$24)","v":""},{"$f":"IF(ISBLANK('FY22-23 Work Plan'!$H$24:$H$24),\"\",'FY22-23 Work Plan'!$H$24:$H$24)","v":""},{"$f":"IF(ISBLANK('FY22-23 Work Plan'!$D$25:$D$25),\"\",'FY22-23 Work Plan'!$D$25:$D$25)","v":""},{"$f":"IF(ISBLANK('FY22-23 Work Plan'!$H$25:$H$25),\"\",'FY22-23 Work Plan'!$H$25:$H$25)","v":""},{"$f":"IF(ISBLANK('FY22-23 Work Plan'!$D$26:$D$26),\"\",'FY22-23 Work Plan'!$D$26:$D$26)","v":""},{"$f":"IF(ISBLANK('FY22-23 Work Plan'!$H$26:$H$26),\"\",'FY22-23 Work Plan'!$H$26:$H$26)","v":""},{"$f":"IF(ISBLANK('FY22-23 Work Plan'!$D$27:$D$27),\"\",'FY22-23 Work Plan'!$D$27:$D$27)","v":""},{"$f":"IF(ISBLANK('FY22-23 Work Plan'!$H$27:$H$27),\"\",'FY22-23 Work Plan'!$H$27:$H$27)","v":""},{"$f":"IF(ISBLANK('FY22-23 Work Plan'!$D$28:$D$28),\"\",'FY22-23 Work Plan'!$D$28:$D$28)","v":""},{"$f":"IF(ISBLANK('FY22-23 Work Plan'!$H$28:$H$28),\"\",'FY22-23 Work Plan'!$H$28:$H$28)","v":""},{"$f":"IF(ISBLANK('FY22-23 Work Plan'!$D$29:$D$29),\"\",'FY22-23 Work Plan'!$D$29:$D$29)","v":""},{"$f":"IF(ISBLANK('FY22-23 Work Plan'!$H$29:$H$29),\"\",'FY22-23 Work Plan'!$H$29:$H$29)","v":""},{"$f":"IF(ISBLANK('FY22-23 Work Plan'!$B$30:$B$30),\"\",'FY22-23 Work Plan'!$B$30:$B$30)","v":""},{"$f":"IF(ISBLANK('FY22-23 Work Plan'!$D$30:$D$30),\"\",'FY22-23 Work Plan'!$D$30:$D$30)","v":""},{"$f":"IF(ISBLANK('FY22-23 Work Plan'!$H$30:$H$30),\"\",'FY22-23 Work Plan'!$H$30:$H$30)","v":""},{"$f":"IF(ISBLANK('FY22-23 Work Plan'!$B$31:$B$31),\"\",'FY22-23 Work Plan'!$B$31:$B$31)","v":""},{"$f":"IF(ISBLANK('FY22-23 Work Plan'!$D$31:$D$31),\"\",'FY22-23 Work Plan'!$D$31:$D$31)","v":""},{"$f":"IF(ISBLANK('FY22-23 Work Plan'!$H$31:$H$31),\"\",'FY22-23 Work Plan'!$H$31:$H$31)","v":""},{"$f":"IF(ISBLANK('FY22-23 Work Plan'!$B$32:$B$32),\"\",'FY22-23 Work Plan'!$B$32:$B$32)","v":""},{"$f":"IF(ISBLANK('FY22-23 Work Plan'!$D$32:$D$32),\"\",'FY22-23 Work Plan'!$D$32:$D$32)","v":""},{"$f":"IF(ISBLANK('FY22-23 Work Plan'!$H$32:$H$32),\"\",'FY22-23 Work Plan'!$H$32:$H$32)","v":""},{"$f":"IF(ISBLANK('FY22-23 Work Plan'!A36),\"\",'FY22-23 Work Plan'!A36)","v":"Alcohol, Marijuana, Methamphetamine, Prescription Drugs"},{"$f":"IF(ISBLANK('FY22-23 Work Plan'!D36),\"\",'FY22-23 Work Plan'!D36)","v":"PA"},{"$f":"IF(ISBLANK('FY22-23 Work Plan'!E36),\"\",'FY22-23 Work Plan'!E36)","v":"Start the PA curriculum at school A"},{"$f":"IF(ISBLANK('FY22-23 Work Plan'!F36),\"\",'FY22-23 Work Plan'!F36)","v":"by June, 2023, there will be 25% Increased knowledge on the impact of substance use on health among youth"},{"$f":"IF(ISBLANK('FY22-23 Work Plan'!H36),\"\",'FY22-23 Work Plan'!H36)","v":"by June 2025, here will be a 3% reduction in alcohol use among the participating youth"},{"$f":"IF(ISBLANK('FY22-23 Work Plan'!I36),\"\",'FY22-23 Work Plan'!I36)","v":"2023-02-01"},{"$f":"IF(ISBLANK('FY22-23 Work Plan'!J36),\"\",'FY22-23 Work Plan'!J36)","v":"2023-06-30"},{"$f":"IF(ISBLANK('FY22-23 Work Plan'!K36),\"\",'FY22-23 Work Plan'!K36)","v":"Sign in sheets"},{"$f":"IF(ISBLANK('FY22-23 Work Plan'!L36),\"\",'FY22-23 Work Plan'!L36)","v":"Pre/post surveys"}]
[{"$f":"IF(ISBLANK('FY22-23 Work Plan'!$E$2:$E$2),\"\",'FY22-23 Work Plan'!$E$2:$E$2)","v":"Asian American Drug Abuse Programs, Inc. (AADAP)"},{"$f":"IF(ISBLANK('FY22-23 Work Plan'!$J$2:$J$2),\"\",'FY22-23 Work Plan'!$J$2:$J$2)","v":"Prevention Education Program (PEP)"},{"$f":"IF(ISBLANK('FY22-23 Work Plan'!$J$3:$J$3),\"\",'FY22-23 Work Plan'!$J$3:$J$3)","v":""},{"$f":"IF(ISBLANK('FY22-23 Work Plan'!$E$3:$E$3),\"\",'FY22-23 Work Plan'!$E$3:$E$3)","v":"PH-004367"},{"$f":"IF(ISBLANK('FY22-23 Work Plan'!$E$4:$E$4),\"\",TEXT('FY22-23 Work Plan'!$E$4:$E$4,\"000000\"))","v":"000001"},{"$f":"IF(ISBLANK('FY22-23 Work Plan'!$J$4:$J$4),\"\",'FY22-23 Work Plan'!$J$4:$J$4)","v":"Building Skills"},{"$f":"IF(ISBLANK('FY22-23 Work Plan'!$E$5:$E$5),\"\",'FY22-23 Work Plan'!$E$5:$E$5)","v":"2 - San Fernando Valley"},{"$f":"IF(ISBLANK('FY22-23 Work Plan'!$J$5:$J$5),\"\",'FY22-23 Work Plan'!$J$5:$J$5)","v":"3rd District, 4th District"},{"$f":"IF(ISBLANK('FY22-23 Work Plan'!$E$6:$E$6),\"\",'FY22-23 Work Plan'!$E$6:$E$6)","v":"Angeles National Forest*, Artesia, Altadena*"},{"$f":"IF(ISBLANK('FY22-23 Work Plan'!$E$7:$E$7),\"\",'FY22-23 Work Plan'!$E$7:$E$7)","v":"Cadillac-Corning, Angeles National Forest"},{"$f":"IF(ISBLANK('FY22-23 Work Plan'!$E$8:$E$8),\"\",'FY22-23 Work Plan'!$E$8:$E$8)","v":"90032, 90036"},{"$f":"IF(ISBLANK('FY22-23 Work Plan'!$E$9:$E$9),\"\",'FY22-23 Work Plan'!$E$9:$E$9)","v":"123 E Main St., Suite 100 \nAnytown, CA 90000"},{"$f":"IF(ISBLANK('FY22-23 Work Plan'!$J$9:$J$9),\"\",TEXT('FY22-23 Work Plan'!$J$9:$J$9,\"###-###-####\"))","v":"999-999-9999"},{"$f":"IF(ISBLANK('FY22-23 Work Plan'!$J$10:$J$10),\"\",'FY22-23 Work Plan'!$J$10:$J$10)","v":"www.abc1.org"},{"$f":"IF(ISBLANK('FY22-23 Work Plan'!$E$11:$E$11),\"\",'FY22-23 Work Plan'!$E$11:$E$11)","v":"123 E Main St., Suite 100 \nAnytown, CA 90000"},{"$f":"IF(ISBLANK('FY22-23 Work Plan'!$J$11:$J$11),\"\",TEXT('FY22-23 Work Plan'!$J$11:$J$11,\"###-###-####\"))","v":"999-999-9999"},{"$f":"IF(ISBLANK('FY22-23 Work Plan'!$J$12:$J$12),\"\",'FY22-23 Work Plan'!$J$12:$J$12)","v":"www.abc2.org"},{"$f":"IF(ISBLANK('FY22-23 Work Plan'!$E$15:$E$15),\"\",'FY22-23 Work Plan'!$E$15:$E$15)","v":"John/Jane Doe"},{"$f":"IF(ISBLANK('FY22-23 Work Plan'!$H$15:$H$15),\"\",TEXT('FY22-23 Work Plan'!$H$15:$H$15,\"###-###-####\"))","v":"213-555-1212"},{"$f":"IF(ISBLANK('FY22-23 Work Plan'!$J$15:$J$15),\"\",'FY22-23 Work Plan'!$J$15:$J$15)","v":"janedoe@preventionusa.com"},{"$f":"IF(ISBLANK('FY22-23 Work Plan'!$E$16:$E$16),\"\",'FY22-23 Work Plan'!$E$16:$E$16)","v":"John/Jane Doe"},{"$f":"IF(ISBLANK('FY22-23 Work Plan'!$H$16:$H$16),\"\",TEXT('FY22-23 Work Plan'!$H$16:$H$16,\"###-###-####\"))","v":"213-555-1212"},{"$f":"IF(ISBLANK('FY22-23 Work Plan'!$J$16:$J$16),\"\",'FY22-23 Work Plan'!$J$16:$J$16)","v":"janedoe@preventionusa.com"},{"$f":"IF(ISBLANK('FY22-23 Work Plan'!$E$17:$E$17),\"\",'FY22-23 Work Plan'!$E$17:$E$17)","v":"John/Jane Doe"},{"$f":"IF(ISBLANK('FY22-23 Work Plan'!$H$17:$H$17),\"\",TEXT('FY22-23 Work Plan'!$H$17:$H$17,\"###-###-####\"))","v":"213-555-1212"},{"$f":"IF(ISBLANK('FY22-23 Work Plan'!$J$17:$J$17),\"\",'FY22-23 Work Plan'!$J$17:$J$17)","v":"j.doe@preventionusa.com"},{"$f":"IF(ISBLANK('FY22-23 Work Plan'!$E$18:$E$18),\"\",'FY22-23 Work Plan'!$E$18:$E$18)","v":"John/Jane Doe"},{"$f":"IF(ISBLANK('FY22-23 Work Plan'!$H$18:$H$18),\"\",TEXT('FY22-23 Work Plan'!$H$18:$H$18,\"###-###-####\"))","v":"213-555-1213"},{"$f":"IF(ISBLANK('FY22-23 Work Plan'!$J$18:$J$18),\"\",'FY22-23 Work Plan'!$J$18:$J$18)","v":"j.doe@preventionusa.com"},{"$f":"IF(ISBLANK('FY22-23 Work Plan'!$E$19:$E$19),\"\",'FY22-23 Work Plan'!$E$19:$E$19)","v":"John/Jane Doe"},{"$f":"IF(ISBLANK('FY22-23 Work Plan'!$H$19:$H$19),\"\",TEXT('FY22-23 Work Plan'!$H$19:$H$19,\"###-###-####\"))","v":"213-555-1213"},{"$f":"IF(ISBLANK('FY22-23 Work Plan'!$J$19:$J$19),\"\",'FY22-23 Work Plan'!$J$19:$J$19)","v":"j.doe@preventionusa.com"},{"$f":"IF(ISBLANK('FY22-23 Work Plan'!$D$23:$D$23),\"\",'FY22-23 Work Plan'!$D$23:$D$23)","v":""},{"$f":"IF(ISBLANK('FY22-23 Work Plan'!$H$23:$H$23),\"\",'FY22-23 Work Plan'!$H$23:$H$23)","v":""},{"$f":"IF(ISBLANK('FY22-23 Work Plan'!$D$24:$D$24),\"\",'FY22-23 Work Plan'!$D$24:$D$24)","v":""},{"$f":"IF(ISBLANK('FY22-23 Work Plan'!$H$24:$H$24),\"\",'FY22-23 Work Plan'!$H$24:$H$24)","v":""},{"$f":"IF(ISBLANK('FY22-23 Work Plan'!$D$25:$D$25),\"\",'FY22-23 Work Plan'!$D$25:$D$25)","v":""},{"$f":"IF(ISBLANK('FY22-23 Work Plan'!$H$25:$H$25),\"\",'FY22-23 Work Plan'!$H$25:$H$25)","v":""},{"$f":"IF(ISBLANK('FY22-23 Work Plan'!$D$26:$D$26),\"\",'FY22-23 Work Plan'!$D$26:$D$26)","v":""},{"$f":"IF(ISBLANK('FY22-23 Work Plan'!$H$26:$H$26),\"\",'FY22-23 Work Plan'!$H$26:$H$26)","v":""},{"$f":"IF(ISBLANK('FY22-23 Work Plan'!$D$27:$D$27),\"\",'FY22-23 Work Plan'!$D$27:$D$27)","v":""},{"$f":"IF(ISBLANK('FY22-23 Work Plan'!$H$27:$H$27),\"\",'FY22-23 Work Plan'!$H$27:$H$27)","v":""},{"$f":"IF(ISBLANK('FY22-23 Work Plan'!$D$28:$D$28),\"\",'FY22-23 Work Plan'!$D$28:$D$28)","v":""},{"$f":"IF(ISBLANK('FY22-23 Work Plan'!$H$28:$H$28),\"\",'FY22-23 Work Plan'!$H$28:$H$28)","v":""},{"$f":"IF(ISBLANK('FY22-23 Work Plan'!$D$29:$D$29),\"\",'FY22-23 Work Plan'!$D$29:$D$29)","v":""},{"$f":"IF(ISBLANK('FY22-23 Work Plan'!$H$29:$H$29),\"\",'FY22-23 Work Plan'!$H$29:$H$29)","v":""},{"$f":"IF(ISBLANK('FY22-23 Work Plan'!$B$30:$B$30),\"\",'FY22-23 Work Plan'!$B$30:$B$30)","v":""},{"$f":"IF(ISBLANK('FY22-23 Work Plan'!$D$30:$D$30),\"\",'FY22-23 Work Plan'!$D$30:$D$30)","v":""},{"$f":"IF(ISBLANK('FY22-23 Work Plan'!$H$30:$H$30),\"\",'FY22-23 Work Plan'!$H$30:$H$30)","v":""},{"$f":"IF(ISBLANK('FY22-23 Work Plan'!$B$31:$B$31),\"\",'FY22-23 Work Plan'!$B$31:$B$31)","v":""},{"$f":"IF(ISBLANK('FY22-23 Work Plan'!$D$31:$D$31),\"\",'FY22-23 Work Plan'!$D$31:$D$31)","v":""},{"$f":"IF(ISBLANK('FY22-23 Work Plan'!$H$31:$H$31),\"\",'FY22-23 Work Plan'!$H$31:$H$31)","v":""},{"$f":"IF(ISBLANK('FY22-23 Work Plan'!$B$32:$B$32),\"\",'FY22-23 Work Plan'!$B$32:$B$32)","v":""},{"$f":"IF(ISBLANK('FY22-23 Work Plan'!$D$32:$D$32),\"\",'FY22-23 Work Plan'!$D$32:$D$32)","v":""},{"$f":"IF(ISBLANK('FY22-23 Work Plan'!$H$32:$H$32),\"\",'FY22-23 Work Plan'!$H$32:$H$32)","v":""},{"$f":"IF(ISBLANK('FY22-23 Work Plan'!A37),\"\",'FY22-23 Work Plan'!A37)","v":"Prescription Drugs, Marijuana"},{"$f":"IF(ISBLANK('FY22-23 Work Plan'!D37),\"\",'FY22-23 Work Plan'!D37)","v":"LST"},{"$f":"IF(ISBLANK('FY22-23 Work Plan'!E37),\"\",'FY22-23 Work Plan'!E37)","v":"Start LST  curriculum at school B"},{"$f":"IF(ISBLANK('FY22-23 Work Plan'!F37),\"\",'FY22-23 Work Plan'!F37)","v":"by June, 2023, there will be 25% Increased knowledge on the impact of substance use on health among youth"},{"$f":"IF(ISBLANK('FY22-23 Work Plan'!H37),\"\",'FY22-23 Work Plan'!H37)","v":"by June 2025, here will be a 3% reduction in alcohol use among the participating youth"},{"$f":"IF(ISBLANK('FY22-23 Work Plan'!I37),\"\",'FY22-23 Work Plan'!I37)","v":"2023-02-01"},{"$f":"IF(ISBLANK('FY22-23 Work Plan'!J37),\"\",'FY22-23 Work Plan'!J37)","v":"2023-06-30"},{"$f":"IF(ISBLANK('FY22-23 Work Plan'!K37),\"\",'FY22-23 Work Plan'!K37)","v":"Sign in sheets"},{"$f":"IF(ISBLANK('FY22-23 Work Plan'!L37),\"\",'FY22-23 Work Plan'!L37)","v":"Pre/post surveys"}]
[{"$f":"IF(ISBLANK('FY22-23 Work Plan'!$E$2:$E$2),\"\",'FY22-23 Work Plan'!$E$2:$E$2)","v":"Asian American Drug Abuse Programs, Inc. (AADAP)"},{"$f":"IF(ISBLANK('FY22-23 Work Plan'!$J$2:$J$2),\"\",'FY22-23 Work Plan'!$J$2:$J$2)","v":"Prevention Education Program (PEP)"},{"$f":"IF(ISBLANK('FY22-23 Work Plan'!$J$3:$J$3),\"\",'FY22-23 Work Plan'!$J$3:$J$3)","v":""},{"$f":"IF(ISBLANK('FY22-23 Work Plan'!$E$3:$E$3),\"\",'FY22-23 Work Plan'!$E$3:$E$3)","v":"PH-004367"},{"$f":"IF(ISBLANK('FY22-23 Work Plan'!$E$4:$E$4),\"\",TEXT('FY22-23 Work Plan'!$E$4:$E$4,\"000000\"))","v":"000001"},{"$f":"IF(ISBLANK('FY22-23 Work Plan'!$J$4:$J$4),\"\",'FY22-23 Work Plan'!$J$4:$J$4)","v":"Building Skills"},{"$f":"IF(ISBLANK('FY22-23 Work Plan'!$E$5:$E$5),\"\",'FY22-23 Work Plan'!$E$5:$E$5)","v":"2 - San Fernando Valley"},{"$f":"IF(ISBLANK('FY22-23 Work Plan'!$J$5:$J$5),\"\",'FY22-23 Work Plan'!$J$5:$J$5)","v":"3rd District, 4th District"},{"$f":"IF(ISBLANK('FY22-23 Work Plan'!$E$6:$E$6),\"\",'FY22-23 Work Plan'!$E$6:$E$6)","v":"Angeles National Forest*, Artesia, Altadena*"},{"$f":"IF(ISBLANK('FY22-23 Work Plan'!$E$7:$E$7),\"\",'FY22-23 Work Plan'!$E$7:$E$7)","v":"Cadillac-Corning, Angeles National Forest"},{"$f":"IF(ISBLANK('FY22-23 Work Plan'!$E$8:$E$8),\"\",'FY22-23 Work Plan'!$E$8:$E$8)","v":"90032, 90036"},{"$f":"IF(ISBLANK('FY22-23 Work Plan'!$E$9:$E$9),\"\",'FY22-23 Work Plan'!$E$9:$E$9)","v":"123 E Main St., Suite 100 \nAnytown, CA 90000"},{"$f":"IF(ISBLANK('FY22-23 Work Plan'!$J$9:$J$9),\"\",TEXT('FY22-23 Work Plan'!$J$9:$J$9,\"###-###-####\"))","v":"999-999-9999"},{"$f":"IF(ISBLANK('FY22-23 Work Plan'!$J$10:$J$10),\"\",'FY22-23 Work Plan'!$J$10:$J$10)","v":"www.abc1.org"},{"$f":"IF(ISBLANK('FY22-23 Work Plan'!$E$11:$E$11),\"\",'FY22-23 Work Plan'!$E$11:$E$11)","v":"123 E Main St., Suite 100 \nAnytown, CA 90000"},{"$f":"IF(ISBLANK('FY22-23 Work Plan'!$J$11:$J$11),\"\",TEXT('FY22-23 Work Plan'!$J$11:$J$11,\"###-###-####\"))","v":"999-999-9999"},{"$f":"IF(ISBLANK('FY22-23 Work Plan'!$J$12:$J$12),\"\",'FY22-23 Work Plan'!$J$12:$J$12)","v":"www.abc2.org"},{"$f":"IF(ISBLANK('FY22-23 Work Plan'!$E$15:$E$15),\"\",'FY22-23 Work Plan'!$E$15:$E$15)","v":"John/Jane Doe"},{"$f":"IF(ISBLANK('FY22-23 Work Plan'!$H$15:$H$15),\"\",TEXT('FY22-23 Work Plan'!$H$15:$H$15,\"###-###-####\"))","v":"213-555-1212"},{"$f":"IF(ISBLANK('FY22-23 Work Plan'!$J$15:$J$15),\"\",'FY22-23 Work Plan'!$J$15:$J$15)","v":"janedoe@preventionusa.com"},{"$f":"IF(ISBLANK('FY22-23 Work Plan'!$E$16:$E$16),\"\",'FY22-23 Work Plan'!$E$16:$E$16)","v":"John/Jane Doe"},{"$f":"IF(ISBLANK('FY22-23 Work Plan'!$H$16:$H$16),\"\",TEXT('FY22-23 Work Plan'!$H$16:$H$16,\"###-###-####\"))","v":"213-555-1212"},{"$f":"IF(ISBLANK('FY22-23 Work Plan'!$J$16:$J$16),\"\",'FY22-23 Work Plan'!$J$16:$J$16)","v":"janedoe@preventionusa.com"},{"$f":"IF(ISBLANK('FY22-23 Work Plan'!$E$17:$E$17),\"\",'FY22-23 Work Plan'!$E$17:$E$17)","v":"John/Jane Doe"},{"$f":"IF(ISBLANK('FY22-23 Work Plan'!$H$17:$H$17),\"\",TEXT('FY22-23 Work Plan'!$H$17:$H$17,\"###-###-####\"))","v":"213-555-1212"},{"$f":"IF(ISBLANK('FY22-23 Work Plan'!$J$17:$J$17),\"\",'FY22-23 Work Plan'!$J$17:$J$17)","v":"j.doe@preventionusa.com"},{"$f":"IF(ISBLANK('FY22-23 Work Plan'!$E$18:$E$18),\"\",'FY22-23 Work Plan'!$E$18:$E$18)","v":"John/Jane Doe"},{"$f":"IF(ISBLANK('FY22-23 Work Plan'!$H$18:$H$18),\"\",TEXT('FY22-23 Work Plan'!$H$18:$H$18,\"###-###-####\"))","v":"213-555-1213"},{"$f":"IF(ISBLANK('FY22-23 Work Plan'!$J$18:$J$18),\"\",'FY22-23 Work Plan'!$J$18:$J$18)","v":"j.doe@preventionusa.com"},{"$f":"IF(ISBLANK('FY22-23 Work Plan'!$E$19:$E$19),\"\",'FY22-23 Work Plan'!$E$19:$E$19)","v":"John/Jane Doe"},{"$f":"IF(ISBLANK('FY22-23 Work Plan'!$H$19:$H$19),\"\",TEXT('FY22-23 Work Plan'!$H$19:$H$19,\"###-###-####\"))","v":"213-555-1213"},{"$f":"IF(ISBLANK('FY22-23 Work Plan'!$J$19:$J$19),\"\",'FY22-23 Work Plan'!$J$19:$J$19)","v":"j.doe@preventionusa.com"},{"$f":"IF(ISBLANK('FY22-23 Work Plan'!$D$23:$D$23),\"\",'FY22-23 Work Plan'!$D$23:$D$23)","v":""},{"$f":"IF(ISBLANK('FY22-23 Work Plan'!$H$23:$H$23),\"\",'FY22-23 Work Plan'!$H$23:$H$23)","v":""},{"$f":"IF(ISBLANK('FY22-23 Work Plan'!$D$24:$D$24),\"\",'FY22-23 Work Plan'!$D$24:$D$24)","v":""},{"$f":"IF(ISBLANK('FY22-23 Work Plan'!$H$24:$H$24),\"\",'FY22-23 Work Plan'!$H$24:$H$24)","v":""},{"$f":"IF(ISBLANK('FY22-23 Work Plan'!$D$25:$D$25),\"\",'FY22-23 Work Plan'!$D$25:$D$25)","v":""},{"$f":"IF(ISBLANK('FY22-23 Work Plan'!$H$25:$H$25),\"\",'FY22-23 Work Plan'!$H$25:$H$25)","v":""},{"$f":"IF(ISBLANK('FY22-23 Work Plan'!$D$26:$D$26),\"\",'FY22-23 Work Plan'!$D$26:$D$26)","v":""},{"$f":"IF(ISBLANK('FY22-23 Work Plan'!$H$26:$H$26),\"\",'FY22-23 Work Plan'!$H$26:$H$26)","v":""},{"$f":"IF(ISBLANK('FY22-23 Work Plan'!$D$27:$D$27),\"\",'FY22-23 Work Plan'!$D$27:$D$27)","v":""},{"$f":"IF(ISBLANK('FY22-23 Work Plan'!$H$27:$H$27),\"\",'FY22-23 Work Plan'!$H$27:$H$27)","v":""},{"$f":"IF(ISBLANK('FY22-23 Work Plan'!$D$28:$D$28),\"\",'FY22-23 Work Plan'!$D$28:$D$28)","v":""},{"$f":"IF(ISBLANK('FY22-23 Work Plan'!$H$28:$H$28),\"\",'FY22-23 Work Plan'!$H$28:$H$28)","v":""},{"$f":"IF(ISBLANK('FY22-23 Work Plan'!$D$29:$D$29),\"\",'FY22-23 Work Plan'!$D$29:$D$29)","v":""},{"$f":"IF(ISBLANK('FY22-23 Work Plan'!$H$29:$H$29),\"\",'FY22-23 Work Plan'!$H$29:$H$29)","v":""},{"$f":"IF(ISBLANK('FY22-23 Work Plan'!$B$30:$B$30),\"\",'FY22-23 Work Plan'!$B$30:$B$30)","v":""},{"$f":"IF(ISBLANK('FY22-23 Work Plan'!$D$30:$D$30),\"\",'FY22-23 Work Plan'!$D$30:$D$30)","v":""},{"$f":"IF(ISBLANK('FY22-23 Work Plan'!$H$30:$H$30),\"\",'FY22-23 Work Plan'!$H$30:$H$30)","v":""},{"$f":"IF(ISBLANK('FY22-23 Work Plan'!$B$31:$B$31),\"\",'FY22-23 Work Plan'!$B$31:$B$31)","v":""},{"$f":"IF(ISBLANK('FY22-23 Work Plan'!$D$31:$D$31),\"\",'FY22-23 Work Plan'!$D$31:$D$31)","v":""},{"$f":"IF(ISBLANK('FY22-23 Work Plan'!$H$31:$H$31),\"\",'FY22-23 Work Plan'!$H$31:$H$31)","v":""},{"$f":"IF(ISBLANK('FY22-23 Work Plan'!$B$32:$B$32),\"\",'FY22-23 Work Plan'!$B$32:$B$32)","v":""},{"$f":"IF(ISBLANK('FY22-23 Work Plan'!$D$32:$D$32),\"\",'FY22-23 Work Plan'!$D$32:$D$32)","v":""},{"$f":"IF(ISBLANK('FY22-23 Work Plan'!$H$32:$H$32),\"\",'FY22-23 Work Plan'!$H$32:$H$32)","v":""},{"$f":"IF(ISBLANK('FY22-23 Work Plan'!A38),\"\",'FY22-23 Work Plan'!A38)","v":"Alcohol, Marijuana"},{"$f":"IF(ISBLANK('FY22-23 Work Plan'!D38),\"\",'FY22-23 Work Plan'!D38)","v":"GGC"},{"$f":"IF(ISBLANK('FY22-23 Work Plan'!E38),\"\",'FY22-23 Work Plan'!E38)","v":"Start the GGC curriculum at school C"},{"$f":"IF(ISBLANK('FY22-23 Work Plan'!F38),\"\",'FY22-23 Work Plan'!F38)","v":"by June, 2023, there will be 25% Increased knowledge on the impact of substance use on health among youth"},{"$f":"IF(ISBLANK('FY22-23 Work Plan'!H38),\"\",'FY22-23 Work Plan'!H38)","v":"by June 2025, here will be a 10% reduction in alcohol use among the participating youth"},{"$f":"IF(ISBLANK('FY22-23 Work Plan'!I38),\"\",'FY22-23 Work Plan'!I38)","v":"2023-02-01"},{"$f":"IF(ISBLANK('FY22-23 Work Plan'!J38),\"\",'FY22-23 Work Plan'!J38)","v":"2023-06-30"},{"$f":"IF(ISBLANK('FY22-23 Work Plan'!K38),\"\",'FY22-23 Work Plan'!K38)","v":"Sign in sheets"},{"$f":"IF(ISBLANK('FY22-23 Work Plan'!L38),\"\",'FY22-23 Work Plan'!L38)","v":"Pre/post surveys"}]
[{"$f":"IF(ISBLANK('FY22-23 Work Plan'!$E$2:$E$2),\"\",'FY22-23 Work Plan'!$E$2:$E$2)","v":"Asian American Drug Abuse Programs, Inc. (AADAP)"},{"$f":"IF(ISBLANK('FY22-23 Work Plan'!$J$2:$J$2),\"\",'FY22-23 Work Plan'!$J$2:$J$2)","v":"Prevention Education Program (PEP)"},{"$f":"IF(ISBLANK('FY22-23 Work Plan'!$J$3:$J$3),\"\",'FY22-23 Work Plan'!$J$3:$J$3)","v":""},{"$f":"IF(ISBLANK('FY22-23 Work Plan'!$E$3:$E$3),\"\",'FY22-23 Work Plan'!$E$3:$E$3)","v":"PH-004367"},{"$f":"IF(ISBLANK('FY22-23 Work Plan'!$E$4:$E$4),\"\",TEXT('FY22-23 Work Plan'!$E$4:$E$4,\"000000\"))","v":"000001"},{"$f":"IF(ISBLANK('FY22-23 Work Plan'!$J$4:$J$4),\"\",'FY22-23 Work Plan'!$J$4:$J$4)","v":"Building Skills"},{"$f":"IF(ISBLANK('FY22-23 Work Plan'!$E$5:$E$5),\"\",'FY22-23 Work Plan'!$E$5:$E$5)","v":"2 - San Fernando Valley"},{"$f":"IF(ISBLANK('FY22-23 Work Plan'!$J$5:$J$5),\"\",'FY22-23 Work Plan'!$J$5:$J$5)","v":"3rd District, 4th District"},{"$f":"IF(ISBLANK('FY22-23 Work Plan'!$E$6:$E$6),\"\",'FY22-23 Work Plan'!$E$6:$E$6)","v":"Angeles National Forest*, Artesia, Altadena*"},{"$f":"IF(ISBLANK('FY22-23 Work Plan'!$E$7:$E$7),\"\",'FY22-23 Work Plan'!$E$7:$E$7)","v":"Cadillac-Corning, Angeles National Forest"},{"$f":"IF(ISBLANK('FY22-23 Work Plan'!$E$8:$E$8),\"\",'FY22-23 Work Plan'!$E$8:$E$8)","v":"90032, 90036"},{"$f":"IF(ISBLANK('FY22-23 Work Plan'!$E$9:$E$9),\"\",'FY22-23 Work Plan'!$E$9:$E$9)","v":"123 E Main St., Suite 100 \nAnytown, CA 90000"},{"$f":"IF(ISBLANK('FY22-23 Work Plan'!$J$9:$J$9),\"\",TEXT('FY22-23 Work Plan'!$J$9:$J$9,\"###-###-####\"))","v":"999-999-9999"},{"$f":"IF(ISBLANK('FY22-23 Work Plan'!$J$10:$J$10),\"\",'FY22-23 Work Plan'!$J$10:$J$10)","v":"www.abc1.org"},{"$f":"IF(ISBLANK('FY22-23 Work Plan'!$E$11:$E$11),\"\",'FY22-23 Work Plan'!$E$11:$E$11)","v":"123 E Main St., Suite 100 \nAnytown, CA 90000"},{"$f":"IF(ISBLANK('FY22-23 Work Plan'!$J$11:$J$11),\"\",TEXT('FY22-23 Work Plan'!$J$11:$J$11,\"###-###-####\"))","v":"999-999-9999"},{"$f":"IF(ISBLANK('FY22-23 Work Plan'!$J$12:$J$12),\"\",'FY22-23 Work Plan'!$J$12:$J$12)","v":"www.abc2.org"},{"$f":"IF(ISBLANK('FY22-23 Work Plan'!$E$15:$E$15),\"\",'FY22-23 Work Plan'!$E$15:$E$15)","v":"John/Jane Doe"},{"$f":"IF(ISBLANK('FY22-23 Work Plan'!$H$15:$H$15),\"\",TEXT('FY22-23 Work Plan'!$H$15:$H$15,\"###-###-####\"))","v":"213-555-1212"},{"$f":"IF(ISBLANK('FY22-23 Work Plan'!$J$15:$J$15),\"\",'FY22-23 Work Plan'!$J$15:$J$15)","v":"janedoe@preventionusa.com"},{"$f":"IF(ISBLANK('FY22-23 Work Plan'!$E$16:$E$16),\"\",'FY22-23 Work Plan'!$E$16:$E$16)","v":"John/Jane Doe"},{"$f":"IF(ISBLANK('FY22-23 Work Plan'!$H$16:$H$16),\"\",TEXT('FY22-23 Work Plan'!$H$16:$H$16,\"###-###-####\"))","v":"213-555-1212"},{"$f":"IF(ISBLANK('FY22-23 Work Plan'!$J$16:$J$16),\"\",'FY22-23 Work Plan'!$J$16:$J$16)","v":"janedoe@preventionusa.com"},{"$f":"IF(ISBLANK('FY22-23 Work Plan'!$E$17:$E$17),\"\",'FY22-23 Work Plan'!$E$17:$E$17)","v":"John/Jane Doe"},{"$f":"IF(ISBLANK('FY22-23 Work Plan'!$H$17:$H$17),\"\",TEXT('FY22-23 Work Plan'!$H$17:$H$17,\"###-###-####\"))","v":"213-555-1212"},{"$f":"IF(ISBLANK('FY22-23 Work Plan'!$J$17:$J$17),\"\",'FY22-23 Work Plan'!$J$17:$J$17)","v":"j.doe@preventionusa.com"},{"$f":"IF(ISBLANK('FY22-23 Work Plan'!$E$18:$E$18),\"\",'FY22-23 Work Plan'!$E$18:$E$18)","v":"John/Jane Doe"},{"$f":"IF(ISBLANK('FY22-23 Work Plan'!$H$18:$H$18),\"\",TEXT('FY22-23 Work Plan'!$H$18:$H$18,\"###-###-####\"))","v":"213-555-1213"},{"$f":"IF(ISBLANK('FY22-23 Work Plan'!$J$18:$J$18),\"\",'FY22-23 Work Plan'!$J$18:$J$18)","v":"j.doe@preventionusa.com"},{"$f":"IF(ISBLANK('FY22-23 Work Plan'!$E$19:$E$19),\"\",'FY22-23 Work Plan'!$E$19:$E$19)","v":"John/Jane Doe"},{"$f":"IF(ISBLANK('FY22-23 Work Plan'!$H$19:$H$19),\"\",TEXT('FY22-23 Work Plan'!$H$19:$H$19,\"###-###-####\"))","v":"213-555-1213"},{"$f":"IF(ISBLANK('FY22-23 Work Plan'!$J$19:$J$19),\"\",'FY22-23 Work Plan'!$J$19:$J$19)","v":"j.doe@preventionusa.com"},{"$f":"IF(ISBLANK('FY22-23 Work Plan'!$D$23:$D$23),\"\",'FY22-23 Work Plan'!$D$23:$D$23)","v":""},{"$f":"IF(ISBLANK('FY22-23 Work Plan'!$H$23:$H$23),\"\",'FY22-23 Work Plan'!$H$23:$H$23)","v":""},{"$f":"IF(ISBLANK('FY22-23 Work Plan'!$D$24:$D$24),\"\",'FY22-23 Work Plan'!$D$24:$D$24)","v":""},{"$f":"IF(ISBLANK('FY22-23 Work Plan'!$H$24:$H$24),\"\",'FY22-23 Work Plan'!$H$24:$H$24)","v":""},{"$f":"IF(ISBLANK('FY22-23 Work Plan'!$D$25:$D$25),\"\",'FY22-23 Work Plan'!$D$25:$D$25)","v":""},{"$f":"IF(ISBLANK('FY22-23 Work Plan'!$H$25:$H$25),\"\",'FY22-23 Work Plan'!$H$25:$H$25)","v":""},{"$f":"IF(ISBLANK('FY22-23 Work Plan'!$D$26:$D$26),\"\",'FY22-23 Work Plan'!$D$26:$D$26)","v":""},{"$f":"IF(ISBLANK('FY22-23 Work Plan'!$H$26:$H$26),\"\",'FY22-23 Work Plan'!$H$26:$H$26)","v":""},{"$f":"IF(ISBLANK('FY22-23 Work Plan'!$D$27:$D$27),\"\",'FY22-23 Work Plan'!$D$27:$D$27)","v":""},{"$f":"IF(ISBLANK('FY22-23 Work Plan'!$H$27:$H$27),\"\",'FY22-23 Work Plan'!$H$27:$H$27)","v":""},{"$f":"IF(ISBLANK('FY22-23 Work Plan'!$D$28:$D$28),\"\",'FY22-23 Work Plan'!$D$28:$D$28)","v":""},{"$f":"IF(ISBLANK('FY22-23 Work Plan'!$H$28:$H$28),\"\",'FY22-23 Work Plan'!$H$28:$H$28)","v":""},{"$f":"IF(ISBLANK('FY22-23 Work Plan'!$D$29:$D$29),\"\",'FY22-23 Work Plan'!$D$29:$D$29)","v":""},{"$f":"IF(ISBLANK('FY22-23 Work Plan'!$H$29:$H$29),\"\",'FY22-23 Work Plan'!$H$29:$H$29)","v":""},{"$f":"IF(ISBLANK('FY22-23 Work Plan'!$B$30:$B$30),\"\",'FY22-23 Work Plan'!$B$30:$B$30)","v":""},{"$f":"IF(ISBLANK('FY22-23 Work Plan'!$D$30:$D$30),\"\",'FY22-23 Work Plan'!$D$30:$D$30)","v":""},{"$f":"IF(ISBLANK('FY22-23 Work Plan'!$H$30:$H$30),\"\",'FY22-23 Work Plan'!$H$30:$H$30)","v":""},{"$f":"IF(ISBLANK('FY22-23 Work Plan'!$B$31:$B$31),\"\",'FY22-23 Work Plan'!$B$31:$B$31)","v":""},{"$f":"IF(ISBLANK('FY22-23 Work Plan'!$D$31:$D$31),\"\",'FY22-23 Work Plan'!$D$31:$D$31)","v":""},{"$f":"IF(ISBLANK('FY22-23 Work Plan'!$H$31:$H$31),\"\",'FY22-23 Work Plan'!$H$31:$H$31)","v":""},{"$f":"IF(ISBLANK('FY22-23 Work Plan'!$B$32:$B$32),\"\",'FY22-23 Work Plan'!$B$32:$B$32)","v":""},{"$f":"IF(ISBLANK('FY22-23 Work Plan'!$D$32:$D$32),\"\",'FY22-23 Work Plan'!$D$32:$D$32)","v":""},{"$f":"IF(ISBLANK('FY22-23 Work Plan'!$H$32:$H$32),\"\",'FY22-23 Work Plan'!$H$32:$H$32)","v":""},{"$f":"IF(ISBLANK('FY22-23 Work Plan'!A39),\"\",'FY22-23 Work Plan'!A39)","v":"Alcohol"},{"$f":"IF(ISBLANK('FY22-23 Work Plan'!D39),\"\",'FY22-23 Work Plan'!D39)","v":"Retail Engagement / Merchant Committed"},{"$f":"IF(ISBLANK('FY22-23 Work Plan'!E39),\"\",'FY22-23 Work Plan'!E39)","v":"Development & Implementation of the Merchant Committed Program at (# of retail) establishments within (specific neighborhood or City) to promote Responsible Beverage Server (RBS) training and create a healthier retail environment. "},{"$f":"IF(ISBLANK('FY22-23 Work Plan'!F39),\"\",'FY22-23 Work Plan'!F39)","v":"by April 30, 2023, there will be 5% reduction in the access and availability of alcohol to youth"},{"$f":"IF(ISBLANK('FY22-23 Work Plan'!H39),\"\",'FY22-23 Work Plan'!H39)","v":"by June 2025, here will be a 10% reduction in alcohol use among the participating youth"},{"$f":"IF(ISBLANK('FY22-23 Work Plan'!I39),\"\",'FY22-23 Work Plan'!I39)","v":"2022-10-15"},{"$f":"IF(ISBLANK('FY22-23 Work Plan'!J39),\"\",'FY22-23 Work Plan'!J39)","v":"2023-04-30"},{"$f":"IF(ISBLANK('FY22-23 Work Plan'!K39),\"\",'FY22-23 Work Plan'!K39)","v":"Log of all local outlets contacted and no. of educational materials provided"},{"$f":"IF(ISBLANK('FY22-23 Work Plan'!L39),\"\",'FY22-23 Work Plan'!L39)","v":"ABC violations in Alhambra"}]
[{"$f":"IF(ISBLANK('FY22-23 Work Plan'!$E$2:$E$2),\"\",'FY22-23 Work Plan'!$E$2:$E$2)","v":"Asian American Drug Abuse Programs, Inc. (AADAP)"},{"$f":"IF(ISBLANK('FY22-23 Work Plan'!$J$2:$J$2),\"\",'FY22-23 Work Plan'!$J$2:$J$2)","v":"Prevention Education Program (PEP)"},{"$f":"IF(ISBLANK('FY22-23 Work Plan'!$J$3:$J$3),\"\",'FY22-23 Work Plan'!$J$3:$J$3)","v":""},{"$f":"IF(ISBLANK('FY22-23 Work Plan'!$E$3:$E$3),\"\",'FY22-23 Work Plan'!$E$3:$E$3)","v":"PH-004367"},{"$f":"IF(ISBLANK('FY22-23 Work Plan'!$E$4:$E$4),\"\",TEXT('FY22-23 Work Plan'!$E$4:$E$4,\"000000\"))","v":"000001"},{"$f":"IF(ISBLANK('FY22-23 Work Plan'!$J$4:$J$4),\"\",'FY22-23 Work Plan'!$J$4:$J$4)","v":"Building Skills"},{"$f":"IF(ISBLANK('FY22-23 Work Plan'!$E$5:$E$5),\"\",'FY22-23 Work Plan'!$E$5:$E$5)","v":"2 - San Fernando Valley"},{"$f":"IF(ISBLANK('FY22-23 Work Plan'!$J$5:$J$5),\"\",'FY22-23 Work Plan'!$J$5:$J$5)","v":"3rd District, 4th District"},{"$f":"IF(ISBLANK('FY22-23 Work Plan'!$E$6:$E$6),\"\",'FY22-23 Work Plan'!$E$6:$E$6)","v":"Angeles National Forest*, Artesia, Altadena*"},{"$f":"IF(ISBLANK('FY22-23 Work Plan'!$E$7:$E$7),\"\",'FY22-23 Work Plan'!$E$7:$E$7)","v":"Cadillac-Corning, Angeles National Forest"},{"$f":"IF(ISBLANK('FY22-23 Work Plan'!$E$8:$E$8),\"\",'FY22-23 Work Plan'!$E$8:$E$8)","v":"90032, 90036"},{"$f":"IF(ISBLANK('FY22-23 Work Plan'!$E$9:$E$9),\"\",'FY22-23 Work Plan'!$E$9:$E$9)","v":"123 E Main St., Suite 100 \nAnytown, CA 90000"},{"$f":"IF(ISBLANK('FY22-23 Work Plan'!$J$9:$J$9),\"\",TEXT('FY22-23 Work Plan'!$J$9:$J$9,\"###-###-####\"))","v":"999-999-9999"},{"$f":"IF(ISBLANK('FY22-23 Work Plan'!$J$10:$J$10),\"\",'FY22-23 Work Plan'!$J$10:$J$10)","v":"www.abc1.org"},{"$f":"IF(ISBLANK('FY22-23 Work Plan'!$E$11:$E$11),\"\",'FY22-23 Work Plan'!$E$11:$E$11)","v":"123 E Main St., Suite 100 \nAnytown, CA 90000"},{"$f":"IF(ISBLANK('FY22-23 Work Plan'!$J$11:$J$11),\"\",TEXT('FY22-23 Work Plan'!$J$11:$J$11,\"###-###-####\"))","v":"999-999-9999"},{"$f":"IF(ISBLANK('FY22-23 Work Plan'!$J$12:$J$12),\"\",'FY22-23 Work Plan'!$J$12:$J$12)","v":"www.abc2.org"},{"$f":"IF(ISBLANK('FY22-23 Work Plan'!$E$15:$E$15),\"\",'FY22-23 Work Plan'!$E$15:$E$15)","v":"John/Jane Doe"},{"$f":"IF(ISBLANK('FY22-23 Work Plan'!$H$15:$H$15),\"\",TEXT('FY22-23 Work Plan'!$H$15:$H$15,\"###-###-####\"))","v":"213-555-1212"},{"$f":"IF(ISBLANK('FY22-23 Work Plan'!$J$15:$J$15),\"\",'FY22-23 Work Plan'!$J$15:$J$15)","v":"janedoe@preventionusa.com"},{"$f":"IF(ISBLANK('FY22-23 Work Plan'!$E$16:$E$16),\"\",'FY22-23 Work Plan'!$E$16:$E$16)","v":"John/Jane Doe"},{"$f":"IF(ISBLANK('FY22-23 Work Plan'!$H$16:$H$16),\"\",TEXT('FY22-23 Work Plan'!$H$16:$H$16,\"###-###-####\"))","v":"213-555-1212"},{"$f":"IF(ISBLANK('FY22-23 Work Plan'!$J$16:$J$16),\"\",'FY22-23 Work Plan'!$J$16:$J$16)","v":"janedoe@preventionusa.com"},{"$f":"IF(ISBLANK('FY22-23 Work Plan'!$E$17:$E$17),\"\",'FY22-23 Work Plan'!$E$17:$E$17)","v":"John/Jane Doe"},{"$f":"IF(ISBLANK('FY22-23 Work Plan'!$H$17:$H$17),\"\",TEXT('FY22-23 Work Plan'!$H$17:$H$17,\"###-###-####\"))","v":"213-555-1212"},{"$f":"IF(ISBLANK('FY22-23 Work Plan'!$J$17:$J$17),\"\",'FY22-23 Work Plan'!$J$17:$J$17)","v":"j.doe@preventionusa.com"},{"$f":"IF(ISBLANK('FY22-23 Work Plan'!$E$18:$E$18),\"\",'FY22-23 Work Plan'!$E$18:$E$18)","v":"John/Jane Doe"},{"$f":"IF(ISBLANK('FY22-23 Work Plan'!$H$18:$H$18),\"\",TEXT('FY22-23 Work Plan'!$H$18:$H$18,\"###-###-####\"))","v":"213-555-1213"},{"$f":"IF(ISBLANK('FY22-23 Work Plan'!$J$18:$J$18),\"\",'FY22-23 Work Plan'!$J$18:$J$18)","v":"j.doe@preventionusa.com"},{"$f":"IF(ISBLANK('FY22-23 Work Plan'!$E$19:$E$19),\"\",'FY22-23 Work Plan'!$E$19:$E$19)","v":"John/Jane Doe"},{"$f":"IF(ISBLANK('FY22-23 Work Plan'!$H$19:$H$19),\"\",TEXT('FY22-23 Work Plan'!$H$19:$H$19,\"###-###-####\"))","v":"213-555-1213"},{"$f":"IF(ISBLANK('FY22-23 Work Plan'!$J$19:$J$19),\"\",'FY22-23 Work Plan'!$J$19:$J$19)","v":"j.doe@preventionusa.com"},{"$f":"IF(ISBLANK('FY22-23 Work Plan'!$D$23:$D$23),\"\",'FY22-23 Work Plan'!$D$23:$D$23)","v":""},{"$f":"IF(ISBLANK('FY22-23 Work Plan'!$H$23:$H$23),\"\",'FY22-23 Work Plan'!$H$23:$H$23)","v":""},{"$f":"IF(ISBLANK('FY22-23 Work Plan'!$D$24:$D$24),\"\",'FY22-23 Work Plan'!$D$24:$D$24)","v":""},{"$f":"IF(ISBLANK('FY22-23 Work Plan'!$H$24:$H$24),\"\",'FY22-23 Work Plan'!$H$24:$H$24)","v":""},{"$f":"IF(ISBLANK('FY22-23 Work Plan'!$D$25:$D$25),\"\",'FY22-23 Work Plan'!$D$25:$D$25)","v":""},{"$f":"IF(ISBLANK('FY22-23 Work Plan'!$H$25:$H$25),\"\",'FY22-23 Work Plan'!$H$25:$H$25)","v":""},{"$f":"IF(ISBLANK('FY22-23 Work Plan'!$D$26:$D$26),\"\",'FY22-23 Work Plan'!$D$26:$D$26)","v":""},{"$f":"IF(ISBLANK('FY22-23 Work Plan'!$H$26:$H$26),\"\",'FY22-23 Work Plan'!$H$26:$H$26)","v":""},{"$f":"IF(ISBLANK('FY22-23 Work Plan'!$D$27:$D$27),\"\",'FY22-23 Work Plan'!$D$27:$D$27)","v":""},{"$f":"IF(ISBLANK('FY22-23 Work Plan'!$H$27:$H$27),\"\",'FY22-23 Work Plan'!$H$27:$H$27)","v":""},{"$f":"IF(ISBLANK('FY22-23 Work Plan'!$D$28:$D$28),\"\",'FY22-23 Work Plan'!$D$28:$D$28)","v":""},{"$f":"IF(ISBLANK('FY22-23 Work Plan'!$H$28:$H$28),\"\",'FY22-23 Work Plan'!$H$28:$H$28)","v":""},{"$f":"IF(ISBLANK('FY22-23 Work Plan'!$D$29:$D$29),\"\",'FY22-23 Work Plan'!$D$29:$D$29)","v":""},{"$f":"IF(ISBLANK('FY22-23 Work Plan'!$H$29:$H$29),\"\",'FY22-23 Work Plan'!$H$29:$H$29)","v":""},{"$f":"IF(ISBLANK('FY22-23 Work Plan'!$B$30:$B$30),\"\",'FY22-23 Work Plan'!$B$30:$B$30)","v":""},{"$f":"IF(ISBLANK('FY22-23 Work Plan'!$D$30:$D$30),\"\",'FY22-23 Work Plan'!$D$30:$D$30)","v":""},{"$f":"IF(ISBLANK('FY22-23 Work Plan'!$H$30:$H$30),\"\",'FY22-23 Work Plan'!$H$30:$H$30)","v":""},{"$f":"IF(ISBLANK('FY22-23 Work Plan'!$B$31:$B$31),\"\",'FY22-23 Work Plan'!$B$31:$B$31)","v":""},{"$f":"IF(ISBLANK('FY22-23 Work Plan'!$D$31:$D$31),\"\",'FY22-23 Work Plan'!$D$31:$D$31)","v":""},{"$f":"IF(ISBLANK('FY22-23 Work Plan'!$H$31:$H$31),\"\",'FY22-23 Work Plan'!$H$31:$H$31)","v":""},{"$f":"IF(ISBLANK('FY22-23 Work Plan'!$B$32:$B$32),\"\",'FY22-23 Work Plan'!$B$32:$B$32)","v":""},{"$f":"IF(ISBLANK('FY22-23 Work Plan'!$D$32:$D$32),\"\",'FY22-23 Work Plan'!$D$32:$D$32)","v":""},{"$f":"IF(ISBLANK('FY22-23 Work Plan'!$H$32:$H$32),\"\",'FY22-23 Work Plan'!$H$32:$H$32)","v":""},{"$f":"IF(ISBLANK('FY22-23 Work Plan'!A40),\"\",'FY22-23 Work Plan'!A40)","v":"Methamphetamine"},{"$f":"IF(ISBLANK('FY22-23 Work Plan'!D40),\"\",'FY22-23 Work Plan'!D40)","v":"Project Meth-1"},{"$f":"IF(ISBLANK('FY22-23 Work Plan'!E40),\"\",'FY22-23 Work Plan'!E40)","v":"Provide Meth Prevention Curriculum at local high schools."},{"$f":"IF(ISBLANK('FY22-23 Work Plan'!F40),\"\",'FY22-23 Work Plan'!F40)","v":"By 2022, youth\nresiliency will increase\nby 1% as measured\nby pre/post survey"},{"$f":"IF(ISBLANK('FY22-23 Work Plan'!H40),\"\",'FY22-23 Work Plan'!H40)","v":"By 2025, youth\nresiliency will\nincrease by 3% as\nmeasured by\npre/post surveys."},{"$f":"IF(ISBLANK('FY22-23 Work Plan'!I40),\"\",'FY22-23 Work Plan'!I40)","v":"2023-01-01"},{"$f":"IF(ISBLANK('FY22-23 Work Plan'!J40),\"\",'FY22-23 Work Plan'!J40)","v":"2023-06-30"},{"$f":"IF(ISBLANK('FY22-23 Work Plan'!K40),\"\",'FY22-23 Work Plan'!K40)","v":"Sign in sheets"},{"$f":"IF(ISBLANK('FY22-23 Work Plan'!L40),\"\",'FY22-23 Work Plan'!L40)","v":"Pre/post surveys"}]
[{"$f":"IF(ISBLANK('FY22-23 Work Plan'!$E$2:$E$2),\"\",'FY22-23 Work Plan'!$E$2:$E$2)","v":"Asian American Drug Abuse Programs, Inc. (AADAP)"},{"$f":"IF(ISBLANK('FY22-23 Work Plan'!$J$2:$J$2),\"\",'FY22-23 Work Plan'!$J$2:$J$2)","v":"Prevention Education Program (PEP)"},{"$f":"IF(ISBLANK('FY22-23 Work Plan'!$J$3:$J$3),\"\",'FY22-23 Work Plan'!$J$3:$J$3)","v":""},{"$f":"IF(ISBLANK('FY22-23 Work Plan'!$E$3:$E$3),\"\",'FY22-23 Work Plan'!$E$3:$E$3)","v":"PH-004367"},{"$f":"IF(ISBLANK('FY22-23 Work Plan'!$E$4:$E$4),\"\",TEXT('FY22-23 Work Plan'!$E$4:$E$4,\"000000\"))","v":"000001"},{"$f":"IF(ISBLANK('FY22-23 Work Plan'!$J$4:$J$4),\"\",'FY22-23 Work Plan'!$J$4:$J$4)","v":"Building Skills"},{"$f":"IF(ISBLANK('FY22-23 Work Plan'!$E$5:$E$5),\"\",'FY22-23 Work Plan'!$E$5:$E$5)","v":"2 - San Fernando Valley"},{"$f":"IF(ISBLANK('FY22-23 Work Plan'!$J$5:$J$5),\"\",'FY22-23 Work Plan'!$J$5:$J$5)","v":"3rd District, 4th District"},{"$f":"IF(ISBLANK('FY22-23 Work Plan'!$E$6:$E$6),\"\",'FY22-23 Work Plan'!$E$6:$E$6)","v":"Angeles National Forest*, Artesia, Altadena*"},{"$f":"IF(ISBLANK('FY22-23 Work Plan'!$E$7:$E$7),\"\",'FY22-23 Work Plan'!$E$7:$E$7)","v":"Cadillac-Corning, Angeles National Forest"},{"$f":"IF(ISBLANK('FY22-23 Work Plan'!$E$8:$E$8),\"\",'FY22-23 Work Plan'!$E$8:$E$8)","v":"90032, 90036"},{"$f":"IF(ISBLANK('FY22-23 Work Plan'!$E$9:$E$9),\"\",'FY22-23 Work Plan'!$E$9:$E$9)","v":"123 E Main St., Suite 100 \nAnytown, CA 90000"},{"$f":"IF(ISBLANK('FY22-23 Work Plan'!$J$9:$J$9),\"\",TEXT('FY22-23 Work Plan'!$J$9:$J$9,\"###-###-####\"))","v":"999-999-9999"},{"$f":"IF(ISBLANK('FY22-23 Work Plan'!$J$10:$J$10),\"\",'FY22-23 Work Plan'!$J$10:$J$10)","v":"www.abc1.org"},{"$f":"IF(ISBLANK('FY22-23 Work Plan'!$E$11:$E$11),\"\",'FY22-23 Work Plan'!$E$11:$E$11)","v":"123 E Main St., Suite 100 \nAnytown, CA 90000"},{"$f":"IF(ISBLANK('FY22-23 Work Plan'!$J$11:$J$11),\"\",TEXT('FY22-23 Work Plan'!$J$11:$J$11,\"###-###-####\"))","v":"999-999-9999"},{"$f":"IF(ISBLANK('FY22-23 Work Plan'!$J$12:$J$12),\"\",'FY22-23 Work Plan'!$J$12:$J$12)","v":"www.abc2.org"},{"$f":"IF(ISBLANK('FY22-23 Work Plan'!$E$15:$E$15),\"\",'FY22-23 Work Plan'!$E$15:$E$15)","v":"John/Jane Doe"},{"$f":"IF(ISBLANK('FY22-23 Work Plan'!$H$15:$H$15),\"\",TEXT('FY22-23 Work Plan'!$H$15:$H$15,\"###-###-####\"))","v":"213-555-1212"},{"$f":"IF(ISBLANK('FY22-23 Work Plan'!$J$15:$J$15),\"\",'FY22-23 Work Plan'!$J$15:$J$15)","v":"janedoe@preventionusa.com"},{"$f":"IF(ISBLANK('FY22-23 Work Plan'!$E$16:$E$16),\"\",'FY22-23 Work Plan'!$E$16:$E$16)","v":"John/Jane Doe"},{"$f":"IF(ISBLANK('FY22-23 Work Plan'!$H$16:$H$16),\"\",TEXT('FY22-23 Work Plan'!$H$16:$H$16,\"###-###-####\"))","v":"213-555-1212"},{"$f":"IF(ISBLANK('FY22-23 Work Plan'!$J$16:$J$16),\"\",'FY22-23 Work Plan'!$J$16:$J$16)","v":"janedoe@preventionusa.com"},{"$f":"IF(ISBLANK('FY22-23 Work Plan'!$E$17:$E$17),\"\",'FY22-23 Work Plan'!$E$17:$E$17)","v":"John/Jane Doe"},{"$f":"IF(ISBLANK('FY22-23 Work Plan'!$H$17:$H$17),\"\",TEXT('FY22-23 Work Plan'!$H$17:$H$17,\"###-###-####\"))","v":"213-555-1212"},{"$f":"IF(ISBLANK('FY22-23 Work Plan'!$J$17:$J$17),\"\",'FY22-23 Work Plan'!$J$17:$J$17)","v":"j.doe@preventionusa.com"},{"$f":"IF(ISBLANK('FY22-23 Work Plan'!$E$18:$E$18),\"\",'FY22-23 Work Plan'!$E$18:$E$18)","v":"John/Jane Doe"},{"$f":"IF(ISBLANK('FY22-23 Work Plan'!$H$18:$H$18),\"\",TEXT('FY22-23 Work Plan'!$H$18:$H$18,\"###-###-####\"))","v":"213-555-1213"},{"$f":"IF(ISBLANK('FY22-23 Work Plan'!$J$18:$J$18),\"\",'FY22-23 Work Plan'!$J$18:$J$18)","v":"j.doe@preventionusa.com"},{"$f":"IF(ISBLANK('FY22-23 Work Plan'!$E$19:$E$19),\"\",'FY22-23 Work Plan'!$E$19:$E$19)","v":"John/Jane Doe"},{"$f":"IF(ISBLANK('FY22-23 Work Plan'!$H$19:$H$19),\"\",TEXT('FY22-23 Work Plan'!$H$19:$H$19,\"###-###-####\"))","v":"213-555-1213"},{"$f":"IF(ISBLANK('FY22-23 Work Plan'!$J$19:$J$19),\"\",'FY22-23 Work Plan'!$J$19:$J$19)","v":"j.doe@preventionusa.com"},{"$f":"IF(ISBLANK('FY22-23 Work Plan'!$D$23:$D$23),\"\",'FY22-23 Work Plan'!$D$23:$D$23)","v":""},{"$f":"IF(ISBLANK('FY22-23 Work Plan'!$H$23:$H$23),\"\",'FY22-23 Work Plan'!$H$23:$H$23)","v":""},{"$f":"IF(ISBLANK('FY22-23 Work Plan'!$D$24:$D$24),\"\",'FY22-23 Work Plan'!$D$24:$D$24)","v":""},{"$f":"IF(ISBLANK('FY22-23 Work Plan'!$H$24:$H$24),\"\",'FY22-23 Work Plan'!$H$24:$H$24)","v":""},{"$f":"IF(ISBLANK('FY22-23 Work Plan'!$D$25:$D$25),\"\",'FY22-23 Work Plan'!$D$25:$D$25)","v":""},{"$f":"IF(ISBLANK('FY22-23 Work Plan'!$H$25:$H$25),\"\",'FY22-23 Work Plan'!$H$25:$H$25)","v":""},{"$f":"IF(ISBLANK('FY22-23 Work Plan'!$D$26:$D$26),\"\",'FY22-23 Work Plan'!$D$26:$D$26)","v":""},{"$f":"IF(ISBLANK('FY22-23 Work Plan'!$H$26:$H$26),\"\",'FY22-23 Work Plan'!$H$26:$H$26)","v":""},{"$f":"IF(ISBLANK('FY22-23 Work Plan'!$D$27:$D$27),\"\",'FY22-23 Work Plan'!$D$27:$D$27)","v":""},{"$f":"IF(ISBLANK('FY22-23 Work Plan'!$H$27:$H$27),\"\",'FY22-23 Work Plan'!$H$27:$H$27)","v":""},{"$f":"IF(ISBLANK('FY22-23 Work Plan'!$D$28:$D$28),\"\",'FY22-23 Work Plan'!$D$28:$D$28)","v":""},{"$f":"IF(ISBLANK('FY22-23 Work Plan'!$H$28:$H$28),\"\",'FY22-23 Work Plan'!$H$28:$H$28)","v":""},{"$f":"IF(ISBLANK('FY22-23 Work Plan'!$D$29:$D$29),\"\",'FY22-23 Work Plan'!$D$29:$D$29)","v":""},{"$f":"IF(ISBLANK('FY22-23 Work Plan'!$H$29:$H$29),\"\",'FY22-23 Work Plan'!$H$29:$H$29)","v":""},{"$f":"IF(ISBLANK('FY22-23 Work Plan'!$B$30:$B$30),\"\",'FY22-23 Work Plan'!$B$30:$B$30)","v":""},{"$f":"IF(ISBLANK('FY22-23 Work Plan'!$D$30:$D$30),\"\",'FY22-23 Work Plan'!$D$30:$D$30)","v":""},{"$f":"IF(ISBLANK('FY22-23 Work Plan'!$H$30:$H$30),\"\",'FY22-23 Work Plan'!$H$30:$H$30)","v":""},{"$f":"IF(ISBLANK('FY22-23 Work Plan'!$B$31:$B$31),\"\",'FY22-23 Work Plan'!$B$31:$B$31)","v":""},{"$f":"IF(ISBLANK('FY22-23 Work Plan'!$D$31:$D$31),\"\",'FY22-23 Work Plan'!$D$31:$D$31)","v":""},{"$f":"IF(ISBLANK('FY22-23 Work Plan'!$H$31:$H$31),\"\",'FY22-23 Work Plan'!$H$31:$H$31)","v":""},{"$f":"IF(ISBLANK('FY22-23 Work Plan'!$B$32:$B$32),\"\",'FY22-23 Work Plan'!$B$32:$B$32)","v":""},{"$f":"IF(ISBLANK('FY22-23 Work Plan'!$D$32:$D$32),\"\",'FY22-23 Work Plan'!$D$32:$D$32)","v":""},{"$f":"IF(ISBLANK('FY22-23 Work Plan'!$H$32:$H$32),\"\",'FY22-23 Work Plan'!$H$32:$H$32)","v":""},{"$f":"IF(ISBLANK('FY22-23 Work Plan'!A41),\"\",'FY22-23 Work Plan'!A41)","v":""},{"$f":"IF(ISBLANK('FY22-23 Work Plan'!D41),\"\",'FY22-23 Work Plan'!D41)","v":""},{"$f":"IF(ISBLANK('FY22-23 Work Plan'!E41),\"\",'FY22-23 Work Plan'!E41)","v":""},{"$f":"IF(ISBLANK('FY22-23 Work Plan'!F41),\"\",'FY22-23 Work Plan'!F41)","v":""},{"$f":"IF(ISBLANK('FY22-23 Work Plan'!H41),\"\",'FY22-23 Work Plan'!H41)","v":""},{"$f":"IF(ISBLANK('FY22-23 Work Plan'!I41),\"\",'FY22-23 Work Plan'!I41)","v":""},{"$f":"IF(ISBLANK('FY22-23 Work Plan'!J41),\"\",'FY22-23 Work Plan'!J41)","v":""},{"$f":"IF(ISBLANK('FY22-23 Work Plan'!K41),\"\",'FY22-23 Work Plan'!K41)","v":""},{"$f":"IF(ISBLANK('FY22-23 Work Plan'!L41),\"\",'FY22-23 Work Plan'!L41)","v":""}]
[{"$f":"IF(ISBLANK('FY22-23 Work Plan'!$E$2:$E$2),\"\",'FY22-23 Work Plan'!$E$2:$E$2)","v":"Asian American Drug Abuse Programs, Inc. (AADAP)"},{"$f":"IF(ISBLANK('FY22-23 Work Plan'!$J$2:$J$2),\"\",'FY22-23 Work Plan'!$J$2:$J$2)","v":"Prevention Education Program (PEP)"},{"$f":"IF(ISBLANK('FY22-23 Work Plan'!$J$3:$J$3),\"\",'FY22-23 Work Plan'!$J$3:$J$3)","v":""},{"$f":"IF(ISBLANK('FY22-23 Work Plan'!$E$3:$E$3),\"\",'FY22-23 Work Plan'!$E$3:$E$3)","v":"PH-004367"},{"$f":"IF(ISBLANK('FY22-23 Work Plan'!$E$4:$E$4),\"\",TEXT('FY22-23 Work Plan'!$E$4:$E$4,\"000000\"))","v":"000001"},{"$f":"IF(ISBLANK('FY22-23 Work Plan'!$J$4:$J$4),\"\",'FY22-23 Work Plan'!$J$4:$J$4)","v":"Building Skills"},{"$f":"IF(ISBLANK('FY22-23 Work Plan'!$E$5:$E$5),\"\",'FY22-23 Work Plan'!$E$5:$E$5)","v":"2 - San Fernando Valley"},{"$f":"IF(ISBLANK('FY22-23 Work Plan'!$J$5:$J$5),\"\",'FY22-23 Work Plan'!$J$5:$J$5)","v":"3rd District, 4th District"},{"$f":"IF(ISBLANK('FY22-23 Work Plan'!$E$6:$E$6),\"\",'FY22-23 Work Plan'!$E$6:$E$6)","v":"Angeles National Forest*, Artesia, Altadena*"},{"$f":"IF(ISBLANK('FY22-23 Work Plan'!$E$7:$E$7),\"\",'FY22-23 Work Plan'!$E$7:$E$7)","v":"Cadillac-Corning, Angeles National Forest"},{"$f":"IF(ISBLANK('FY22-23 Work Plan'!$E$8:$E$8),\"\",'FY22-23 Work Plan'!$E$8:$E$8)","v":"90032, 90036"},{"$f":"IF(ISBLANK('FY22-23 Work Plan'!$E$9:$E$9),\"\",'FY22-23 Work Plan'!$E$9:$E$9)","v":"123 E Main St., Suite 100 \nAnytown, CA 90000"},{"$f":"IF(ISBLANK('FY22-23 Work Plan'!$J$9:$J$9),\"\",TEXT('FY22-23 Work Plan'!$J$9:$J$9,\"###-###-####\"))","v":"999-999-9999"},{"$f":"IF(ISBLANK('FY22-23 Work Plan'!$J$10:$J$10),\"\",'FY22-23 Work Plan'!$J$10:$J$10)","v":"www.abc1.org"},{"$f":"IF(ISBLANK('FY22-23 Work Plan'!$E$11:$E$11),\"\",'FY22-23 Work Plan'!$E$11:$E$11)","v":"123 E Main St., Suite 100 \nAnytown, CA 90000"},{"$f":"IF(ISBLANK('FY22-23 Work Plan'!$J$11:$J$11),\"\",TEXT('FY22-23 Work Plan'!$J$11:$J$11,\"###-###-####\"))","v":"999-999-9999"},{"$f":"IF(ISBLANK('FY22-23 Work Plan'!$J$12:$J$12),\"\",'FY22-23 Work Plan'!$J$12:$J$12)","v":"www.abc2.org"},{"$f":"IF(ISBLANK('FY22-23 Work Plan'!$E$15:$E$15),\"\",'FY22-23 Work Plan'!$E$15:$E$15)","v":"John/Jane Doe"},{"$f":"IF(ISBLANK('FY22-23 Work Plan'!$H$15:$H$15),\"\",TEXT('FY22-23 Work Plan'!$H$15:$H$15,\"###-###-####\"))","v":"213-555-1212"},{"$f":"IF(ISBLANK('FY22-23 Work Plan'!$J$15:$J$15),\"\",'FY22-23 Work Plan'!$J$15:$J$15)","v":"janedoe@preventionusa.com"},{"$f":"IF(ISBLANK('FY22-23 Work Plan'!$E$16:$E$16),\"\",'FY22-23 Work Plan'!$E$16:$E$16)","v":"John/Jane Doe"},{"$f":"IF(ISBLANK('FY22-23 Work Plan'!$H$16:$H$16),\"\",TEXT('FY22-23 Work Plan'!$H$16:$H$16,\"###-###-####\"))","v":"213-555-1212"},{"$f":"IF(ISBLANK('FY22-23 Work Plan'!$J$16:$J$16),\"\",'FY22-23 Work Plan'!$J$16:$J$16)","v":"janedoe@preventionusa.com"},{"$f":"IF(ISBLANK('FY22-23 Work Plan'!$E$17:$E$17),\"\",'FY22-23 Work Plan'!$E$17:$E$17)","v":"John/Jane Doe"},{"$f":"IF(ISBLANK('FY22-23 Work Plan'!$H$17:$H$17),\"\",TEXT('FY22-23 Work Plan'!$H$17:$H$17,\"###-###-####\"))","v":"213-555-1212"},{"$f":"IF(ISBLANK('FY22-23 Work Plan'!$J$17:$J$17),\"\",'FY22-23 Work Plan'!$J$17:$J$17)","v":"j.doe@preventionusa.com"},{"$f":"IF(ISBLANK('FY22-23 Work Plan'!$E$18:$E$18),\"\",'FY22-23 Work Plan'!$E$18:$E$18)","v":"John/Jane Doe"},{"$f":"IF(ISBLANK('FY22-23 Work Plan'!$H$18:$H$18),\"\",TEXT('FY22-23 Work Plan'!$H$18:$H$18,\"###-###-####\"))","v":"213-555-1213"},{"$f":"IF(ISBLANK('FY22-23 Work Plan'!$J$18:$J$18),\"\",'FY22-23 Work Plan'!$J$18:$J$18)","v":"j.doe@preventionusa.com"},{"$f":"IF(ISBLANK('FY22-23 Work Plan'!$E$19:$E$19),\"\",'FY22-23 Work Plan'!$E$19:$E$19)","v":"John/Jane Doe"},{"$f":"IF(ISBLANK('FY22-23 Work Plan'!$H$19:$H$19),\"\",TEXT('FY22-23 Work Plan'!$H$19:$H$19,\"###-###-####\"))","v":"213-555-1213"},{"$f":"IF(ISBLANK('FY22-23 Work Plan'!$J$19:$J$19),\"\",'FY22-23 Work Plan'!$J$19:$J$19)","v":"j.doe@preventionusa.com"},{"$f":"IF(ISBLANK('FY22-23 Work Plan'!$D$23:$D$23),\"\",'FY22-23 Work Plan'!$D$23:$D$23)","v":""},{"$f":"IF(ISBLANK('FY22-23 Work Plan'!$H$23:$H$23),\"\",'FY22-23 Work Plan'!$H$23:$H$23)","v":""},{"$f":"IF(ISBLANK('FY22-23 Work Plan'!$D$24:$D$24),\"\",'FY22-23 Work Plan'!$D$24:$D$24)","v":""},{"$f":"IF(ISBLANK('FY22-23 Work Plan'!$H$24:$H$24),\"\",'FY22-23 Work Plan'!$H$24:$H$24)","v":""},{"$f":"IF(ISBLANK('FY22-23 Work Plan'!$D$25:$D$25),\"\",'FY22-23 Work Plan'!$D$25:$D$25)","v":""},{"$f":"IF(ISBLANK('FY22-23 Work Plan'!$H$25:$H$25),\"\",'FY22-23 Work Plan'!$H$25:$H$25)","v":""},{"$f":"IF(ISBLANK('FY22-23 Work Plan'!$D$26:$D$26),\"\",'FY22-23 Work Plan'!$D$26:$D$26)","v":""},{"$f":"IF(ISBLANK('FY22-23 Work Plan'!$H$26:$H$26),\"\",'FY22-23 Work Plan'!$H$26:$H$26)","v":""},{"$f":"IF(ISBLANK('FY22-23 Work Plan'!$D$27:$D$27),\"\",'FY22-23 Work Plan'!$D$27:$D$27)","v":""},{"$f":"IF(ISBLANK('FY22-23 Work Plan'!$H$27:$H$27),\"\",'FY22-23 Work Plan'!$H$27:$H$27)","v":""},{"$f":"IF(ISBLANK('FY22-23 Work Plan'!$D$28:$D$28),\"\",'FY22-23 Work Plan'!$D$28:$D$28)","v":""},{"$f":"IF(ISBLANK('FY22-23 Work Plan'!$H$28:$H$28),\"\",'FY22-23 Work Plan'!$H$28:$H$28)","v":""},{"$f":"IF(ISBLANK('FY22-23 Work Plan'!$D$29:$D$29),\"\",'FY22-23 Work Plan'!$D$29:$D$29)","v":""},{"$f":"IF(ISBLANK('FY22-23 Work Plan'!$H$29:$H$29),\"\",'FY22-23 Work Plan'!$H$29:$H$29)","v":""},{"$f":"IF(ISBLANK('FY22-23 Work Plan'!$B$30:$B$30),\"\",'FY22-23 Work Plan'!$B$30:$B$30)","v":""},{"$f":"IF(ISBLANK('FY22-23 Work Plan'!$D$30:$D$30),\"\",'FY22-23 Work Plan'!$D$30:$D$30)","v":""},{"$f":"IF(ISBLANK('FY22-23 Work Plan'!$H$30:$H$30),\"\",'FY22-23 Work Plan'!$H$30:$H$30)","v":""},{"$f":"IF(ISBLANK('FY22-23 Work Plan'!$B$31:$B$31),\"\",'FY22-23 Work Plan'!$B$31:$B$31)","v":""},{"$f":"IF(ISBLANK('FY22-23 Work Plan'!$D$31:$D$31),\"\",'FY22-23 Work Plan'!$D$31:$D$31)","v":""},{"$f":"IF(ISBLANK('FY22-23 Work Plan'!$H$31:$H$31),\"\",'FY22-23 Work Plan'!$H$31:$H$31)","v":""},{"$f":"IF(ISBLANK('FY22-23 Work Plan'!$B$32:$B$32),\"\",'FY22-23 Work Plan'!$B$32:$B$32)","v":""},{"$f":"IF(ISBLANK('FY22-23 Work Plan'!$D$32:$D$32),\"\",'FY22-23 Work Plan'!$D$32:$D$32)","v":""},{"$f":"IF(ISBLANK('FY22-23 Work Plan'!$H$32:$H$32),\"\",'FY22-23 Work Plan'!$H$32:$H$32)","v":""},{"$f":"IF(ISBLANK('FY22-23 Work Plan'!A42),\"\",'FY22-23 Work Plan'!A42)","v":""},{"$f":"IF(ISBLANK('FY22-23 Work Plan'!D42),\"\",'FY22-23 Work Plan'!D42)","v":""},{"$f":"IF(ISBLANK('FY22-23 Work Plan'!E42),\"\",'FY22-23 Work Plan'!E42)","v":""},{"$f":"IF(ISBLANK('FY22-23 Work Plan'!F42),\"\",'FY22-23 Work Plan'!F42)","v":""},{"$f":"IF(ISBLANK('FY22-23 Work Plan'!H42),\"\",'FY22-23 Work Plan'!H42)","v":""},{"$f":"IF(ISBLANK('FY22-23 Work Plan'!I42),\"\",'FY22-23 Work Plan'!I42)","v":""},{"$f":"IF(ISBLANK('FY22-23 Work Plan'!J42),\"\",'FY22-23 Work Plan'!J42)","v":""},{"$f":"IF(ISBLANK('FY22-23 Work Plan'!K42),\"\",'FY22-23 Work Plan'!K42)","v":""},{"$f":"IF(ISBLANK('FY22-23 Work Plan'!L42),\"\",'FY22-23 Work Plan'!L42)","v":""}]
[{"$f":"IF(ISBLANK('FY22-23 Work Plan'!$E$2:$E$2),\"\",'FY22-23 Work Plan'!$E$2:$E$2)","v":"Asian American Drug Abuse Programs, Inc. (AADAP)"},{"$f":"IF(ISBLANK('FY22-23 Work Plan'!$J$2:$J$2),\"\",'FY22-23 Work Plan'!$J$2:$J$2)","v":"Prevention Education Program (PEP)"},{"$f":"IF(ISBLANK('FY22-23 Work Plan'!$J$3:$J$3),\"\",'FY22-23 Work Plan'!$J$3:$J$3)","v":""},{"$f":"IF(ISBLANK('FY22-23 Work Plan'!$E$3:$E$3),\"\",'FY22-23 Work Plan'!$E$3:$E$3)","v":"PH-004367"},{"$f":"IF(ISBLANK('FY22-23 Work Plan'!$E$4:$E$4),\"\",TEXT('FY22-23 Work Plan'!$E$4:$E$4,\"000000\"))","v":"000001"},{"$f":"IF(ISBLANK('FY22-23 Work Plan'!$J$4:$J$4),\"\",'FY22-23 Work Plan'!$J$4:$J$4)","v":"Building Skills"},{"$f":"IF(ISBLANK('FY22-23 Work Plan'!$E$5:$E$5),\"\",'FY22-23 Work Plan'!$E$5:$E$5)","v":"2 - San Fernando Valley"},{"$f":"IF(ISBLANK('FY22-23 Work Plan'!$J$5:$J$5),\"\",'FY22-23 Work Plan'!$J$5:$J$5)","v":"3rd District, 4th District"},{"$f":"IF(ISBLANK('FY22-23 Work Plan'!$E$6:$E$6),\"\",'FY22-23 Work Plan'!$E$6:$E$6)","v":"Angeles National Forest*, Artesia, Altadena*"},{"$f":"IF(ISBLANK('FY22-23 Work Plan'!$E$7:$E$7),\"\",'FY22-23 Work Plan'!$E$7:$E$7)","v":"Cadillac-Corning, Angeles National Forest"},{"$f":"IF(ISBLANK('FY22-23 Work Plan'!$E$8:$E$8),\"\",'FY22-23 Work Plan'!$E$8:$E$8)","v":"90032, 90036"},{"$f":"IF(ISBLANK('FY22-23 Work Plan'!$E$9:$E$9),\"\",'FY22-23 Work Plan'!$E$9:$E$9)","v":"123 E Main St., Suite 100 \nAnytown, CA 90000"},{"$f":"IF(ISBLANK('FY22-23 Work Plan'!$J$9:$J$9),\"\",TEXT('FY22-23 Work Plan'!$J$9:$J$9,\"###-###-####\"))","v":"999-999-9999"},{"$f":"IF(ISBLANK('FY22-23 Work Plan'!$J$10:$J$10),\"\",'FY22-23 Work Plan'!$J$10:$J$10)","v":"www.abc1.org"},{"$f":"IF(ISBLANK('FY22-23 Work Plan'!$E$11:$E$11),\"\",'FY22-23 Work Plan'!$E$11:$E$11)","v":"123 E Main St., Suite 100 \nAnytown, CA 90000"},{"$f":"IF(ISBLANK('FY22-23 Work Plan'!$J$11:$J$11),\"\",TEXT('FY22-23 Work Plan'!$J$11:$J$11,\"###-###-####\"))","v":"999-999-9999"},{"$f":"IF(ISBLANK('FY22-23 Work Plan'!$J$12:$J$12),\"\",'FY22-23 Work Plan'!$J$12:$J$12)","v":"www.abc2.org"},{"$f":"IF(ISBLANK('FY22-23 Work Plan'!$E$15:$E$15),\"\",'FY22-23 Work Plan'!$E$15:$E$15)","v":"John/Jane Doe"},{"$f":"IF(ISBLANK('FY22-23 Work Plan'!$H$15:$H$15),\"\",TEXT('FY22-23 Work Plan'!$H$15:$H$15,\"###-###-####\"))","v":"213-555-1212"},{"$f":"IF(ISBLANK('FY22-23 Work Plan'!$J$15:$J$15),\"\",'FY22-23 Work Plan'!$J$15:$J$15)","v":"janedoe@preventionusa.com"},{"$f":"IF(ISBLANK('FY22-23 Work Plan'!$E$16:$E$16),\"\",'FY22-23 Work Plan'!$E$16:$E$16)","v":"John/Jane Doe"},{"$f":"IF(ISBLANK('FY22-23 Work Plan'!$H$16:$H$16),\"\",TEXT('FY22-23 Work Plan'!$H$16:$H$16,\"###-###-####\"))","v":"213-555-1212"},{"$f":"IF(ISBLANK('FY22-23 Work Plan'!$J$16:$J$16),\"\",'FY22-23 Work Plan'!$J$16:$J$16)","v":"janedoe@preventionusa.com"},{"$f":"IF(ISBLANK('FY22-23 Work Plan'!$E$17:$E$17),\"\",'FY22-23 Work Plan'!$E$17:$E$17)","v":"John/Jane Doe"},{"$f":"IF(ISBLANK('FY22-23 Work Plan'!$H$17:$H$17),\"\",TEXT('FY22-23 Work Plan'!$H$17:$H$17,\"###-###-####\"))","v":"213-555-1212"},{"$f":"IF(ISBLANK('FY22-23 Work Plan'!$J$17:$J$17),\"\",'FY22-23 Work Plan'!$J$17:$J$17)","v":"j.doe@preventionusa.com"},{"$f":"IF(ISBLANK('FY22-23 Work Plan'!$E$18:$E$18),\"\",'FY22-23 Work Plan'!$E$18:$E$18)","v":"John/Jane Doe"},{"$f":"IF(ISBLANK('FY22-23 Work Plan'!$H$18:$H$18),\"\",TEXT('FY22-23 Work Plan'!$H$18:$H$18,\"###-###-####\"))","v":"213-555-1213"},{"$f":"IF(ISBLANK('FY22-23 Work Plan'!$J$18:$J$18),\"\",'FY22-23 Work Plan'!$J$18:$J$18)","v":"j.doe@preventionusa.com"},{"$f":"IF(ISBLANK('FY22-23 Work Plan'!$E$19:$E$19),\"\",'FY22-23 Work Plan'!$E$19:$E$19)","v":"John/Jane Doe"},{"$f":"IF(ISBLANK('FY22-23 Work Plan'!$H$19:$H$19),\"\",TEXT('FY22-23 Work Plan'!$H$19:$H$19,\"###-###-####\"))","v":"213-555-1213"},{"$f":"IF(ISBLANK('FY22-23 Work Plan'!$J$19:$J$19),\"\",'FY22-23 Work Plan'!$J$19:$J$19)","v":"j.doe@preventionusa.com"},{"$f":"IF(ISBLANK('FY22-23 Work Plan'!$D$23:$D$23),\"\",'FY22-23 Work Plan'!$D$23:$D$23)","v":""},{"$f":"IF(ISBLANK('FY22-23 Work Plan'!$H$23:$H$23),\"\",'FY22-23 Work Plan'!$H$23:$H$23)","v":""},{"$f":"IF(ISBLANK('FY22-23 Work Plan'!$D$24:$D$24),\"\",'FY22-23 Work Plan'!$D$24:$D$24)","v":""},{"$f":"IF(ISBLANK('FY22-23 Work Plan'!$H$24:$H$24),\"\",'FY22-23 Work Plan'!$H$24:$H$24)","v":""},{"$f":"IF(ISBLANK('FY22-23 Work Plan'!$D$25:$D$25),\"\",'FY22-23 Work Plan'!$D$25:$D$25)","v":""},{"$f":"IF(ISBLANK('FY22-23 Work Plan'!$H$25:$H$25),\"\",'FY22-23 Work Plan'!$H$25:$H$25)","v":""},{"$f":"IF(ISBLANK('FY22-23 Work Plan'!$D$26:$D$26),\"\",'FY22-23 Work Plan'!$D$26:$D$26)","v":""},{"$f":"IF(ISBLANK('FY22-23 Work Plan'!$H$26:$H$26),\"\",'FY22-23 Work Plan'!$H$26:$H$26)","v":""},{"$f":"IF(ISBLANK('FY22-23 Work Plan'!$D$27:$D$27),\"\",'FY22-23 Work Plan'!$D$27:$D$27)","v":""},{"$f":"IF(ISBLANK('FY22-23 Work Plan'!$H$27:$H$27),\"\",'FY22-23 Work Plan'!$H$27:$H$27)","v":""},{"$f":"IF(ISBLANK('FY22-23 Work Plan'!$D$28:$D$28),\"\",'FY22-23 Work Plan'!$D$28:$D$28)","v":""},{"$f":"IF(ISBLANK('FY22-23 Work Plan'!$H$28:$H$28),\"\",'FY22-23 Work Plan'!$H$28:$H$28)","v":""},{"$f":"IF(ISBLANK('FY22-23 Work Plan'!$D$29:$D$29),\"\",'FY22-23 Work Plan'!$D$29:$D$29)","v":""},{"$f":"IF(ISBLANK('FY22-23 Work Plan'!$H$29:$H$29),\"\",'FY22-23 Work Plan'!$H$29:$H$29)","v":""},{"$f":"IF(ISBLANK('FY22-23 Work Plan'!$B$30:$B$30),\"\",'FY22-23 Work Plan'!$B$30:$B$30)","v":""},{"$f":"IF(ISBLANK('FY22-23 Work Plan'!$D$30:$D$30),\"\",'FY22-23 Work Plan'!$D$30:$D$30)","v":""},{"$f":"IF(ISBLANK('FY22-23 Work Plan'!$H$30:$H$30),\"\",'FY22-23 Work Plan'!$H$30:$H$30)","v":""},{"$f":"IF(ISBLANK('FY22-23 Work Plan'!$B$31:$B$31),\"\",'FY22-23 Work Plan'!$B$31:$B$31)","v":""},{"$f":"IF(ISBLANK('FY22-23 Work Plan'!$D$31:$D$31),\"\",'FY22-23 Work Plan'!$D$31:$D$31)","v":""},{"$f":"IF(ISBLANK('FY22-23 Work Plan'!$H$31:$H$31),\"\",'FY22-23 Work Plan'!$H$31:$H$31)","v":""},{"$f":"IF(ISBLANK('FY22-23 Work Plan'!$B$32:$B$32),\"\",'FY22-23 Work Plan'!$B$32:$B$32)","v":""},{"$f":"IF(ISBLANK('FY22-23 Work Plan'!$D$32:$D$32),\"\",'FY22-23 Work Plan'!$D$32:$D$32)","v":""},{"$f":"IF(ISBLANK('FY22-23 Work Plan'!$H$32:$H$32),\"\",'FY22-23 Work Plan'!$H$32:$H$32)","v":""},{"$f":"IF(ISBLANK('FY22-23 Work Plan'!A43),\"\",'FY22-23 Work Plan'!A43)","v":""},{"$f":"IF(ISBLANK('FY22-23 Work Plan'!D43),\"\",'FY22-23 Work Plan'!D43)","v":""},{"$f":"IF(ISBLANK('FY22-23 Work Plan'!E43),\"\",'FY22-23 Work Plan'!E43)","v":""},{"$f":"IF(ISBLANK('FY22-23 Work Plan'!F43),\"\",'FY22-23 Work Plan'!F43)","v":""},{"$f":"IF(ISBLANK('FY22-23 Work Plan'!H43),\"\",'FY22-23 Work Plan'!H43)","v":""},{"$f":"IF(ISBLANK('FY22-23 Work Plan'!I43),\"\",'FY22-23 Work Plan'!I43)","v":""},{"$f":"IF(ISBLANK('FY22-23 Work Plan'!J43),\"\",'FY22-23 Work Plan'!J43)","v":""},{"$f":"IF(ISBLANK('FY22-23 Work Plan'!K43),\"\",'FY22-23 Work Plan'!K43)","v":""},{"$f":"IF(ISBLANK('FY22-23 Work Plan'!L43),\"\",'FY22-23 Work Plan'!L43)","v":""}]
[{"$f":"IF(ISBLANK('FY22-23 Work Plan'!$E$2:$E$2),\"\",'FY22-23 Work Plan'!$E$2:$E$2)","v":"Asian American Drug Abuse Programs, Inc. (AADAP)"},{"$f":"IF(ISBLANK('FY22-23 Work Plan'!$J$2:$J$2),\"\",'FY22-23 Work Plan'!$J$2:$J$2)","v":"Prevention Education Program (PEP)"},{"$f":"IF(ISBLANK('FY22-23 Work Plan'!$J$3:$J$3),\"\",'FY22-23 Work Plan'!$J$3:$J$3)","v":""},{"$f":"IF(ISBLANK('FY22-23 Work Plan'!$E$3:$E$3),\"\",'FY22-23 Work Plan'!$E$3:$E$3)","v":"PH-004367"},{"$f":"IF(ISBLANK('FY22-23 Work Plan'!$E$4:$E$4),\"\",TEXT('FY22-23 Work Plan'!$E$4:$E$4,\"000000\"))","v":"000001"},{"$f":"IF(ISBLANK('FY22-23 Work Plan'!$J$4:$J$4),\"\",'FY22-23 Work Plan'!$J$4:$J$4)","v":"Building Skills"},{"$f":"IF(ISBLANK('FY22-23 Work Plan'!$E$5:$E$5),\"\",'FY22-23 Work Plan'!$E$5:$E$5)","v":"2 - San Fernando Valley"},{"$f":"IF(ISBLANK('FY22-23 Work Plan'!$J$5:$J$5),\"\",'FY22-23 Work Plan'!$J$5:$J$5)","v":"3rd District, 4th District"},{"$f":"IF(ISBLANK('FY22-23 Work Plan'!$E$6:$E$6),\"\",'FY22-23 Work Plan'!$E$6:$E$6)","v":"Angeles National Forest*, Artesia, Altadena*"},{"$f":"IF(ISBLANK('FY22-23 Work Plan'!$E$7:$E$7),\"\",'FY22-23 Work Plan'!$E$7:$E$7)","v":"Cadillac-Corning, Angeles National Forest"},{"$f":"IF(ISBLANK('FY22-23 Work Plan'!$E$8:$E$8),\"\",'FY22-23 Work Plan'!$E$8:$E$8)","v":"90032, 90036"},{"$f":"IF(ISBLANK('FY22-23 Work Plan'!$E$9:$E$9),\"\",'FY22-23 Work Plan'!$E$9:$E$9)","v":"123 E Main St., Suite 100 \nAnytown, CA 90000"},{"$f":"IF(ISBLANK('FY22-23 Work Plan'!$J$9:$J$9),\"\",TEXT('FY22-23 Work Plan'!$J$9:$J$9,\"###-###-####\"))","v":"999-999-9999"},{"$f":"IF(ISBLANK('FY22-23 Work Plan'!$J$10:$J$10),\"\",'FY22-23 Work Plan'!$J$10:$J$10)","v":"www.abc1.org"},{"$f":"IF(ISBLANK('FY22-23 Work Plan'!$E$11:$E$11),\"\",'FY22-23 Work Plan'!$E$11:$E$11)","v":"123 E Main St., Suite 100 \nAnytown, CA 90000"},{"$f":"IF(ISBLANK('FY22-23 Work Plan'!$J$11:$J$11),\"\",TEXT('FY22-23 Work Plan'!$J$11:$J$11,\"###-###-####\"))","v":"999-999-9999"},{"$f":"IF(ISBLANK('FY22-23 Work Plan'!$J$12:$J$12),\"\",'FY22-23 Work Plan'!$J$12:$J$12)","v":"www.abc2.org"},{"$f":"IF(ISBLANK('FY22-23 Work Plan'!$E$15:$E$15),\"\",'FY22-23 Work Plan'!$E$15:$E$15)","v":"John/Jane Doe"},{"$f":"IF(ISBLANK('FY22-23 Work Plan'!$H$15:$H$15),\"\",TEXT('FY22-23 Work Plan'!$H$15:$H$15,\"###-###-####\"))","v":"213-555-1212"},{"$f":"IF(ISBLANK('FY22-23 Work Plan'!$J$15:$J$15),\"\",'FY22-23 Work Plan'!$J$15:$J$15)","v":"janedoe@preventionusa.com"},{"$f":"IF(ISBLANK('FY22-23 Work Plan'!$E$16:$E$16),\"\",'FY22-23 Work Plan'!$E$16:$E$16)","v":"John/Jane Doe"},{"$f":"IF(ISBLANK('FY22-23 Work Plan'!$H$16:$H$16),\"\",TEXT('FY22-23 Work Plan'!$H$16:$H$16,\"###-###-####\"))","v":"213-555-1212"},{"$f":"IF(ISBLANK('FY22-23 Work Plan'!$J$16:$J$16),\"\",'FY22-23 Work Plan'!$J$16:$J$16)","v":"janedoe@preventionusa.com"},{"$f":"IF(ISBLANK('FY22-23 Work Plan'!$E$17:$E$17),\"\",'FY22-23 Work Plan'!$E$17:$E$17)","v":"John/Jane Doe"},{"$f":"IF(ISBLANK('FY22-23 Work Plan'!$H$17:$H$17),\"\",TEXT('FY22-23 Work Plan'!$H$17:$H$17,\"###-###-####\"))","v":"213-555-1212"},{"$f":"IF(ISBLANK('FY22-23 Work Plan'!$J$17:$J$17),\"\",'FY22-23 Work Plan'!$J$17:$J$17)","v":"j.doe@preventionusa.com"},{"$f":"IF(ISBLANK('FY22-23 Work Plan'!$E$18:$E$18),\"\",'FY22-23 Work Plan'!$E$18:$E$18)","v":"John/Jane Doe"},{"$f":"IF(ISBLANK('FY22-23 Work Plan'!$H$18:$H$18),\"\",TEXT('FY22-23 Work Plan'!$H$18:$H$18,\"###-###-####\"))","v":"213-555-1213"},{"$f":"IF(ISBLANK('FY22-23 Work Plan'!$J$18:$J$18),\"\",'FY22-23 Work Plan'!$J$18:$J$18)","v":"j.doe@preventionusa.com"},{"$f":"IF(ISBLANK('FY22-23 Work Plan'!$E$19:$E$19),\"\",'FY22-23 Work Plan'!$E$19:$E$19)","v":"John/Jane Doe"},{"$f":"IF(ISBLANK('FY22-23 Work Plan'!$H$19:$H$19),\"\",TEXT('FY22-23 Work Plan'!$H$19:$H$19,\"###-###-####\"))","v":"213-555-1213"},{"$f":"IF(ISBLANK('FY22-23 Work Plan'!$J$19:$J$19),\"\",'FY22-23 Work Plan'!$J$19:$J$19)","v":"j.doe@preventionusa.com"},{"$f":"IF(ISBLANK('FY22-23 Work Plan'!$D$23:$D$23),\"\",'FY22-23 Work Plan'!$D$23:$D$23)","v":""},{"$f":"IF(ISBLANK('FY22-23 Work Plan'!$H$23:$H$23),\"\",'FY22-23 Work Plan'!$H$23:$H$23)","v":""},{"$f":"IF(ISBLANK('FY22-23 Work Plan'!$D$24:$D$24),\"\",'FY22-23 Work Plan'!$D$24:$D$24)","v":""},{"$f":"IF(ISBLANK('FY22-23 Work Plan'!$H$24:$H$24),\"\",'FY22-23 Work Plan'!$H$24:$H$24)","v":""},{"$f":"IF(ISBLANK('FY22-23 Work Plan'!$D$25:$D$25),\"\",'FY22-23 Work Plan'!$D$25:$D$25)","v":""},{"$f":"IF(ISBLANK('FY22-23 Work Plan'!$H$25:$H$25),\"\",'FY22-23 Work Plan'!$H$25:$H$25)","v":""},{"$f":"IF(ISBLANK('FY22-23 Work Plan'!$D$26:$D$26),\"\",'FY22-23 Work Plan'!$D$26:$D$26)","v":""},{"$f":"IF(ISBLANK('FY22-23 Work Plan'!$H$26:$H$26),\"\",'FY22-23 Work Plan'!$H$26:$H$26)","v":""},{"$f":"IF(ISBLANK('FY22-23 Work Plan'!$D$27:$D$27),\"\",'FY22-23 Work Plan'!$D$27:$D$27)","v":""},{"$f":"IF(ISBLANK('FY22-23 Work Plan'!$H$27:$H$27),\"\",'FY22-23 Work Plan'!$H$27:$H$27)","v":""},{"$f":"IF(ISBLANK('FY22-23 Work Plan'!$D$28:$D$28),\"\",'FY22-23 Work Plan'!$D$28:$D$28)","v":""},{"$f":"IF(ISBLANK('FY22-23 Work Plan'!$H$28:$H$28),\"\",'FY22-23 Work Plan'!$H$28:$H$28)","v":""},{"$f":"IF(ISBLANK('FY22-23 Work Plan'!$D$29:$D$29),\"\",'FY22-23 Work Plan'!$D$29:$D$29)","v":""},{"$f":"IF(ISBLANK('FY22-23 Work Plan'!$H$29:$H$29),\"\",'FY22-23 Work Plan'!$H$29:$H$29)","v":""},{"$f":"IF(ISBLANK('FY22-23 Work Plan'!$B$30:$B$30),\"\",'FY22-23 Work Plan'!$B$30:$B$30)","v":""},{"$f":"IF(ISBLANK('FY22-23 Work Plan'!$D$30:$D$30),\"\",'FY22-23 Work Plan'!$D$30:$D$30)","v":""},{"$f":"IF(ISBLANK('FY22-23 Work Plan'!$H$30:$H$30),\"\",'FY22-23 Work Plan'!$H$30:$H$30)","v":""},{"$f":"IF(ISBLANK('FY22-23 Work Plan'!$B$31:$B$31),\"\",'FY22-23 Work Plan'!$B$31:$B$31)","v":""},{"$f":"IF(ISBLANK('FY22-23 Work Plan'!$D$31:$D$31),\"\",'FY22-23 Work Plan'!$D$31:$D$31)","v":""},{"$f":"IF(ISBLANK('FY22-23 Work Plan'!$H$31:$H$31),\"\",'FY22-23 Work Plan'!$H$31:$H$31)","v":""},{"$f":"IF(ISBLANK('FY22-23 Work Plan'!$B$32:$B$32),\"\",'FY22-23 Work Plan'!$B$32:$B$32)","v":""},{"$f":"IF(ISBLANK('FY22-23 Work Plan'!$D$32:$D$32),\"\",'FY22-23 Work Plan'!$D$32:$D$32)","v":""},{"$f":"IF(ISBLANK('FY22-23 Work Plan'!$H$32:$H$32),\"\",'FY22-23 Work Plan'!$H$32:$H$32)","v":""},{"$f":"IF(ISBLANK('FY22-23 Work Plan'!A44),\"\",'FY22-23 Work Plan'!A44)","v":""},{"$f":"IF(ISBLANK('FY22-23 Work Plan'!D44),\"\",'FY22-23 Work Plan'!D44)","v":""},{"$f":"IF(ISBLANK('FY22-23 Work Plan'!E44),\"\",'FY22-23 Work Plan'!E44)","v":""},{"$f":"IF(ISBLANK('FY22-23 Work Plan'!F44),\"\",'FY22-23 Work Plan'!F44)","v":""},{"$f":"IF(ISBLANK('FY22-23 Work Plan'!H44),\"\",'FY22-23 Work Plan'!H44)","v":""},{"$f":"IF(ISBLANK('FY22-23 Work Plan'!I44),\"\",'FY22-23 Work Plan'!I44)","v":""},{"$f":"IF(ISBLANK('FY22-23 Work Plan'!J44),\"\",'FY22-23 Work Plan'!J44)","v":""},{"$f":"IF(ISBLANK('FY22-23 Work Plan'!K44),\"\",'FY22-23 Work Plan'!K44)","v":""},{"$f":"IF(ISBLANK('FY22-23 Work Plan'!L44),\"\",'FY22-23 Work Plan'!L44)","v":""}]
[{"$f":"IF(ISBLANK('FY22-23 Work Plan'!$E$2:$E$2),\"\",'FY22-23 Work Plan'!$E$2:$E$2)","v":"Asian American Drug Abuse Programs, Inc. (AADAP)"},{"$f":"IF(ISBLANK('FY22-23 Work Plan'!$J$2:$J$2),\"\",'FY22-23 Work Plan'!$J$2:$J$2)","v":"Prevention Education Program (PEP)"},{"$f":"IF(ISBLANK('FY22-23 Work Plan'!$J$3:$J$3),\"\",'FY22-23 Work Plan'!$J$3:$J$3)","v":""},{"$f":"IF(ISBLANK('FY22-23 Work Plan'!$E$3:$E$3),\"\",'FY22-23 Work Plan'!$E$3:$E$3)","v":"PH-004367"},{"$f":"IF(ISBLANK('FY22-23 Work Plan'!$E$4:$E$4),\"\",TEXT('FY22-23 Work Plan'!$E$4:$E$4,\"000000\"))","v":"000001"},{"$f":"IF(ISBLANK('FY22-23 Work Plan'!$J$4:$J$4),\"\",'FY22-23 Work Plan'!$J$4:$J$4)","v":"Building Skills"},{"$f":"IF(ISBLANK('FY22-23 Work Plan'!$E$5:$E$5),\"\",'FY22-23 Work Plan'!$E$5:$E$5)","v":"2 - San Fernando Valley"},{"$f":"IF(ISBLANK('FY22-23 Work Plan'!$J$5:$J$5),\"\",'FY22-23 Work Plan'!$J$5:$J$5)","v":"3rd District, 4th District"},{"$f":"IF(ISBLANK('FY22-23 Work Plan'!$E$6:$E$6),\"\",'FY22-23 Work Plan'!$E$6:$E$6)","v":"Angeles National Forest*, Artesia, Altadena*"},{"$f":"IF(ISBLANK('FY22-23 Work Plan'!$E$7:$E$7),\"\",'FY22-23 Work Plan'!$E$7:$E$7)","v":"Cadillac-Corning, Angeles National Forest"},{"$f":"IF(ISBLANK('FY22-23 Work Plan'!$E$8:$E$8),\"\",'FY22-23 Work Plan'!$E$8:$E$8)","v":"90032, 90036"},{"$f":"IF(ISBLANK('FY22-23 Work Plan'!$E$9:$E$9),\"\",'FY22-23 Work Plan'!$E$9:$E$9)","v":"123 E Main St., Suite 100 \nAnytown, CA 90000"},{"$f":"IF(ISBLANK('FY22-23 Work Plan'!$J$9:$J$9),\"\",TEXT('FY22-23 Work Plan'!$J$9:$J$9,\"###-###-####\"))","v":"999-999-9999"},{"$f":"IF(ISBLANK('FY22-23 Work Plan'!$J$10:$J$10),\"\",'FY22-23 Work Plan'!$J$10:$J$10)","v":"www.abc1.org"},{"$f":"IF(ISBLANK('FY22-23 Work Plan'!$E$11:$E$11),\"\",'FY22-23 Work Plan'!$E$11:$E$11)","v":"123 E Main St., Suite 100 \nAnytown, CA 90000"},{"$f":"IF(ISBLANK('FY22-23 Work Plan'!$J$11:$J$11),\"\",TEXT('FY22-23 Work Plan'!$J$11:$J$11,\"###-###-####\"))","v":"999-999-9999"},{"$f":"IF(ISBLANK('FY22-23 Work Plan'!$J$12:$J$12),\"\",'FY22-23 Work Plan'!$J$12:$J$12)","v":"www.abc2.org"},{"$f":"IF(ISBLANK('FY22-23 Work Plan'!$E$15:$E$15),\"\",'FY22-23 Work Plan'!$E$15:$E$15)","v":"John/Jane Doe"},{"$f":"IF(ISBLANK('FY22-23 Work Plan'!$H$15:$H$15),\"\",TEXT('FY22-23 Work Plan'!$H$15:$H$15,\"###-###-####\"))","v":"213-555-1212"},{"$f":"IF(ISBLANK('FY22-23 Work Plan'!$J$15:$J$15),\"\",'FY22-23 Work Plan'!$J$15:$J$15)","v":"janedoe@preventionusa.com"},{"$f":"IF(ISBLANK('FY22-23 Work Plan'!$E$16:$E$16),\"\",'FY22-23 Work Plan'!$E$16:$E$16)","v":"John/Jane Doe"},{"$f":"IF(ISBLANK('FY22-23 Work Plan'!$H$16:$H$16),\"\",TEXT('FY22-23 Work Plan'!$H$16:$H$16,\"###-###-####\"))","v":"213-555-1212"},{"$f":"IF(ISBLANK('FY22-23 Work Plan'!$J$16:$J$16),\"\",'FY22-23 Work Plan'!$J$16:$J$16)","v":"janedoe@preventionusa.com"},{"$f":"IF(ISBLANK('FY22-23 Work Plan'!$E$17:$E$17),\"\",'FY22-23 Work Plan'!$E$17:$E$17)","v":"John/Jane Doe"},{"$f":"IF(ISBLANK('FY22-23 Work Plan'!$H$17:$H$17),\"\",TEXT('FY22-23 Work Plan'!$H$17:$H$17,\"###-###-####\"))","v":"213-555-1212"},{"$f":"IF(ISBLANK('FY22-23 Work Plan'!$J$17:$J$17),\"\",'FY22-23 Work Plan'!$J$17:$J$17)","v":"j.doe@preventionusa.com"},{"$f":"IF(ISBLANK('FY22-23 Work Plan'!$E$18:$E$18),\"\",'FY22-23 Work Plan'!$E$18:$E$18)","v":"John/Jane Doe"},{"$f":"IF(ISBLANK('FY22-23 Work Plan'!$H$18:$H$18),\"\",TEXT('FY22-23 Work Plan'!$H$18:$H$18,\"###-###-####\"))","v":"213-555-1213"},{"$f":"IF(ISBLANK('FY22-23 Work Plan'!$J$18:$J$18),\"\",'FY22-23 Work Plan'!$J$18:$J$18)","v":"j.doe@preventionusa.com"},{"$f":"IF(ISBLANK('FY22-23 Work Plan'!$E$19:$E$19),\"\",'FY22-23 Work Plan'!$E$19:$E$19)","v":"John/Jane Doe"},{"$f":"IF(ISBLANK('FY22-23 Work Plan'!$H$19:$H$19),\"\",TEXT('FY22-23 Work Plan'!$H$19:$H$19,\"###-###-####\"))","v":"213-555-1213"},{"$f":"IF(ISBLANK('FY22-23 Work Plan'!$J$19:$J$19),\"\",'FY22-23 Work Plan'!$J$19:$J$19)","v":"j.doe@preventionusa.com"},{"$f":"IF(ISBLANK('FY22-23 Work Plan'!$D$23:$D$23),\"\",'FY22-23 Work Plan'!$D$23:$D$23)","v":""},{"$f":"IF(ISBLANK('FY22-23 Work Plan'!$H$23:$H$23),\"\",'FY22-23 Work Plan'!$H$23:$H$23)","v":""},{"$f":"IF(ISBLANK('FY22-23 Work Plan'!$D$24:$D$24),\"\",'FY22-23 Work Plan'!$D$24:$D$24)","v":""},{"$f":"IF(ISBLANK('FY22-23 Work Plan'!$H$24:$H$24),\"\",'FY22-23 Work Plan'!$H$24:$H$24)","v":""},{"$f":"IF(ISBLANK('FY22-23 Work Plan'!$D$25:$D$25),\"\",'FY22-23 Work Plan'!$D$25:$D$25)","v":""},{"$f":"IF(ISBLANK('FY22-23 Work Plan'!$H$25:$H$25),\"\",'FY22-23 Work Plan'!$H$25:$H$25)","v":""},{"$f":"IF(ISBLANK('FY22-23 Work Plan'!$D$26:$D$26),\"\",'FY22-23 Work Plan'!$D$26:$D$26)","v":""},{"$f":"IF(ISBLANK('FY22-23 Work Plan'!$H$26:$H$26),\"\",'FY22-23 Work Plan'!$H$26:$H$26)","v":""},{"$f":"IF(ISBLANK('FY22-23 Work Plan'!$D$27:$D$27),\"\",'FY22-23 Work Plan'!$D$27:$D$27)","v":""},{"$f":"IF(ISBLANK('FY22-23 Work Plan'!$H$27:$H$27),\"\",'FY22-23 Work Plan'!$H$27:$H$27)","v":""},{"$f":"IF(ISBLANK('FY22-23 Work Plan'!$D$28:$D$28),\"\",'FY22-23 Work Plan'!$D$28:$D$28)","v":""},{"$f":"IF(ISBLANK('FY22-23 Work Plan'!$H$28:$H$28),\"\",'FY22-23 Work Plan'!$H$28:$H$28)","v":""},{"$f":"IF(ISBLANK('FY22-23 Work Plan'!$D$29:$D$29),\"\",'FY22-23 Work Plan'!$D$29:$D$29)","v":""},{"$f":"IF(ISBLANK('FY22-23 Work Plan'!$H$29:$H$29),\"\",'FY22-23 Work Plan'!$H$29:$H$29)","v":""},{"$f":"IF(ISBLANK('FY22-23 Work Plan'!$B$30:$B$30),\"\",'FY22-23 Work Plan'!$B$30:$B$30)","v":""},{"$f":"IF(ISBLANK('FY22-23 Work Plan'!$D$30:$D$30),\"\",'FY22-23 Work Plan'!$D$30:$D$30)","v":""},{"$f":"IF(ISBLANK('FY22-23 Work Plan'!$H$30:$H$30),\"\",'FY22-23 Work Plan'!$H$30:$H$30)","v":""},{"$f":"IF(ISBLANK('FY22-23 Work Plan'!$B$31:$B$31),\"\",'FY22-23 Work Plan'!$B$31:$B$31)","v":""},{"$f":"IF(ISBLANK('FY22-23 Work Plan'!$D$31:$D$31),\"\",'FY22-23 Work Plan'!$D$31:$D$31)","v":""},{"$f":"IF(ISBLANK('FY22-23 Work Plan'!$H$31:$H$31),\"\",'FY22-23 Work Plan'!$H$31:$H$31)","v":""},{"$f":"IF(ISBLANK('FY22-23 Work Plan'!$B$32:$B$32),\"\",'FY22-23 Work Plan'!$B$32:$B$32)","v":""},{"$f":"IF(ISBLANK('FY22-23 Work Plan'!$D$32:$D$32),\"\",'FY22-23 Work Plan'!$D$32:$D$32)","v":""},{"$f":"IF(ISBLANK('FY22-23 Work Plan'!$H$32:$H$32),\"\",'FY22-23 Work Plan'!$H$32:$H$32)","v":""},{"$f":"IF(ISBLANK('FY22-23 Work Plan'!A45),\"\",'FY22-23 Work Plan'!A45)","v":""},{"$f":"IF(ISBLANK('FY22-23 Work Plan'!D45),\"\",'FY22-23 Work Plan'!D45)","v":""},{"$f":"IF(ISBLANK('FY22-23 Work Plan'!E45),\"\",'FY22-23 Work Plan'!E45)","v":""},{"$f":"IF(ISBLANK('FY22-23 Work Plan'!F45),\"\",'FY22-23 Work Plan'!F45)","v":""},{"$f":"IF(ISBLANK('FY22-23 Work Plan'!H45),\"\",'FY22-23 Work Plan'!H45)","v":""},{"$f":"IF(ISBLANK('FY22-23 Work Plan'!I45),\"\",'FY22-23 Work Plan'!I45)","v":""},{"$f":"IF(ISBLANK('FY22-23 Work Plan'!J45),\"\",'FY22-23 Work Plan'!J45)","v":""},{"$f":"IF(ISBLANK('FY22-23 Work Plan'!K45),\"\",'FY22-23 Work Plan'!K45)","v":""},{"$f":"IF(ISBLANK('FY22-23 Work Plan'!L45),\"\",'FY22-23 Work Plan'!L45)","v":""}]
[{"$f":"IF(ISBLANK('FY22-23 Work Plan'!$E$2:$E$2),\"\",'FY22-23 Work Plan'!$E$2:$E$2)","v":"Asian American Drug Abuse Programs, Inc. (AADAP)"},{"$f":"IF(ISBLANK('FY22-23 Work Plan'!$J$2:$J$2),\"\",'FY22-23 Work Plan'!$J$2:$J$2)","v":"Prevention Education Program (PEP)"},{"$f":"IF(ISBLANK('FY22-23 Work Plan'!$J$3:$J$3),\"\",'FY22-23 Work Plan'!$J$3:$J$3)","v":""},{"$f":"IF(ISBLANK('FY22-23 Work Plan'!$E$3:$E$3),\"\",'FY22-23 Work Plan'!$E$3:$E$3)","v":"PH-004367"},{"$f":"IF(ISBLANK('FY22-23 Work Plan'!$E$4:$E$4),\"\",TEXT('FY22-23 Work Plan'!$E$4:$E$4,\"000000\"))","v":"000001"},{"$f":"IF(ISBLANK('FY22-23 Work Plan'!$J$4:$J$4),\"\",'FY22-23 Work Plan'!$J$4:$J$4)","v":"Building Skills"},{"$f":"IF(ISBLANK('FY22-23 Work Plan'!$E$5:$E$5),\"\",'FY22-23 Work Plan'!$E$5:$E$5)","v":"2 - San Fernando Valley"},{"$f":"IF(ISBLANK('FY22-23 Work Plan'!$J$5:$J$5),\"\",'FY22-23 Work Plan'!$J$5:$J$5)","v":"3rd District, 4th District"},{"$f":"IF(ISBLANK('FY22-23 Work Plan'!$E$6:$E$6),\"\",'FY22-23 Work Plan'!$E$6:$E$6)","v":"Angeles National Forest*, Artesia, Altadena*"},{"$f":"IF(ISBLANK('FY22-23 Work Plan'!$E$7:$E$7),\"\",'FY22-23 Work Plan'!$E$7:$E$7)","v":"Cadillac-Corning, Angeles National Forest"},{"$f":"IF(ISBLANK('FY22-23 Work Plan'!$E$8:$E$8),\"\",'FY22-23 Work Plan'!$E$8:$E$8)","v":"90032, 90036"},{"$f":"IF(ISBLANK('FY22-23 Work Plan'!$E$9:$E$9),\"\",'FY22-23 Work Plan'!$E$9:$E$9)","v":"123 E Main St., Suite 100 \nAnytown, CA 90000"},{"$f":"IF(ISBLANK('FY22-23 Work Plan'!$J$9:$J$9),\"\",TEXT('FY22-23 Work Plan'!$J$9:$J$9,\"###-###-####\"))","v":"999-999-9999"},{"$f":"IF(ISBLANK('FY22-23 Work Plan'!$J$10:$J$10),\"\",'FY22-23 Work Plan'!$J$10:$J$10)","v":"www.abc1.org"},{"$f":"IF(ISBLANK('FY22-23 Work Plan'!$E$11:$E$11),\"\",'FY22-23 Work Plan'!$E$11:$E$11)","v":"123 E Main St., Suite 100 \nAnytown, CA 90000"},{"$f":"IF(ISBLANK('FY22-23 Work Plan'!$J$11:$J$11),\"\",TEXT('FY22-23 Work Plan'!$J$11:$J$11,\"###-###-####\"))","v":"999-999-9999"},{"$f":"IF(ISBLANK('FY22-23 Work Plan'!$J$12:$J$12),\"\",'FY22-23 Work Plan'!$J$12:$J$12)","v":"www.abc2.org"},{"$f":"IF(ISBLANK('FY22-23 Work Plan'!$E$15:$E$15),\"\",'FY22-23 Work Plan'!$E$15:$E$15)","v":"John/Jane Doe"},{"$f":"IF(ISBLANK('FY22-23 Work Plan'!$H$15:$H$15),\"\",TEXT('FY22-23 Work Plan'!$H$15:$H$15,\"###-###-####\"))","v":"213-555-1212"},{"$f":"IF(ISBLANK('FY22-23 Work Plan'!$J$15:$J$15),\"\",'FY22-23 Work Plan'!$J$15:$J$15)","v":"janedoe@preventionusa.com"},{"$f":"IF(ISBLANK('FY22-23 Work Plan'!$E$16:$E$16),\"\",'FY22-23 Work Plan'!$E$16:$E$16)","v":"John/Jane Doe"},{"$f":"IF(ISBLANK('FY22-23 Work Plan'!$H$16:$H$16),\"\",TEXT('FY22-23 Work Plan'!$H$16:$H$16,\"###-###-####\"))","v":"213-555-1212"},{"$f":"IF(ISBLANK('FY22-23 Work Plan'!$J$16:$J$16),\"\",'FY22-23 Work Plan'!$J$16:$J$16)","v":"janedoe@preventionusa.com"},{"$f":"IF(ISBLANK('FY22-23 Work Plan'!$E$17:$E$17),\"\",'FY22-23 Work Plan'!$E$17:$E$17)","v":"John/Jane Doe"},{"$f":"IF(ISBLANK('FY22-23 Work Plan'!$H$17:$H$17),\"\",TEXT('FY22-23 Work Plan'!$H$17:$H$17,\"###-###-####\"))","v":"213-555-1212"},{"$f":"IF(ISBLANK('FY22-23 Work Plan'!$J$17:$J$17),\"\",'FY22-23 Work Plan'!$J$17:$J$17)","v":"j.doe@preventionusa.com"},{"$f":"IF(ISBLANK('FY22-23 Work Plan'!$E$18:$E$18),\"\",'FY22-23 Work Plan'!$E$18:$E$18)","v":"John/Jane Doe"},{"$f":"IF(ISBLANK('FY22-23 Work Plan'!$H$18:$H$18),\"\",TEXT('FY22-23 Work Plan'!$H$18:$H$18,\"###-###-####\"))","v":"213-555-1213"},{"$f":"IF(ISBLANK('FY22-23 Work Plan'!$J$18:$J$18),\"\",'FY22-23 Work Plan'!$J$18:$J$18)","v":"j.doe@preventionusa.com"},{"$f":"IF(ISBLANK('FY22-23 Work Plan'!$E$19:$E$19),\"\",'FY22-23 Work Plan'!$E$19:$E$19)","v":"John/Jane Doe"},{"$f":"IF(ISBLANK('FY22-23 Work Plan'!$H$19:$H$19),\"\",TEXT('FY22-23 Work Plan'!$H$19:$H$19,\"###-###-####\"))","v":"213-555-1213"},{"$f":"IF(ISBLANK('FY22-23 Work Plan'!$J$19:$J$19),\"\",'FY22-23 Work Plan'!$J$19:$J$19)","v":"j.doe@preventionusa.com"},{"$f":"IF(ISBLANK('FY22-23 Work Plan'!$D$23:$D$23),\"\",'FY22-23 Work Plan'!$D$23:$D$23)","v":""},{"$f":"IF(ISBLANK('FY22-23 Work Plan'!$H$23:$H$23),\"\",'FY22-23 Work Plan'!$H$23:$H$23)","v":""},{"$f":"IF(ISBLANK('FY22-23 Work Plan'!$D$24:$D$24),\"\",'FY22-23 Work Plan'!$D$24:$D$24)","v":""},{"$f":"IF(ISBLANK('FY22-23 Work Plan'!$H$24:$H$24),\"\",'FY22-23 Work Plan'!$H$24:$H$24)","v":""},{"$f":"IF(ISBLANK('FY22-23 Work Plan'!$D$25:$D$25),\"\",'FY22-23 Work Plan'!$D$25:$D$25)","v":""},{"$f":"IF(ISBLANK('FY22-23 Work Plan'!$H$25:$H$25),\"\",'FY22-23 Work Plan'!$H$25:$H$25)","v":""},{"$f":"IF(ISBLANK('FY22-23 Work Plan'!$D$26:$D$26),\"\",'FY22-23 Work Plan'!$D$26:$D$26)","v":""},{"$f":"IF(ISBLANK('FY22-23 Work Plan'!$H$26:$H$26),\"\",'FY22-23 Work Plan'!$H$26:$H$26)","v":""},{"$f":"IF(ISBLANK('FY22-23 Work Plan'!$D$27:$D$27),\"\",'FY22-23 Work Plan'!$D$27:$D$27)","v":""},{"$f":"IF(ISBLANK('FY22-23 Work Plan'!$H$27:$H$27),\"\",'FY22-23 Work Plan'!$H$27:$H$27)","v":""},{"$f":"IF(ISBLANK('FY22-23 Work Plan'!$D$28:$D$28),\"\",'FY22-23 Work Plan'!$D$28:$D$28)","v":""},{"$f":"IF(ISBLANK('FY22-23 Work Plan'!$H$28:$H$28),\"\",'FY22-23 Work Plan'!$H$28:$H$28)","v":""},{"$f":"IF(ISBLANK('FY22-23 Work Plan'!$D$29:$D$29),\"\",'FY22-23 Work Plan'!$D$29:$D$29)","v":""},{"$f":"IF(ISBLANK('FY22-23 Work Plan'!$H$29:$H$29),\"\",'FY22-23 Work Plan'!$H$29:$H$29)","v":""},{"$f":"IF(ISBLANK('FY22-23 Work Plan'!$B$30:$B$30),\"\",'FY22-23 Work Plan'!$B$30:$B$30)","v":""},{"$f":"IF(ISBLANK('FY22-23 Work Plan'!$D$30:$D$30),\"\",'FY22-23 Work Plan'!$D$30:$D$30)","v":""},{"$f":"IF(ISBLANK('FY22-23 Work Plan'!$H$30:$H$30),\"\",'FY22-23 Work Plan'!$H$30:$H$30)","v":""},{"$f":"IF(ISBLANK('FY22-23 Work Plan'!$B$31:$B$31),\"\",'FY22-23 Work Plan'!$B$31:$B$31)","v":""},{"$f":"IF(ISBLANK('FY22-23 Work Plan'!$D$31:$D$31),\"\",'FY22-23 Work Plan'!$D$31:$D$31)","v":""},{"$f":"IF(ISBLANK('FY22-23 Work Plan'!$H$31:$H$31),\"\",'FY22-23 Work Plan'!$H$31:$H$31)","v":""},{"$f":"IF(ISBLANK('FY22-23 Work Plan'!$B$32:$B$32),\"\",'FY22-23 Work Plan'!$B$32:$B$32)","v":""},{"$f":"IF(ISBLANK('FY22-23 Work Plan'!$D$32:$D$32),\"\",'FY22-23 Work Plan'!$D$32:$D$32)","v":""},{"$f":"IF(ISBLANK('FY22-23 Work Plan'!$H$32:$H$32),\"\",'FY22-23 Work Plan'!$H$32:$H$32)","v":""},{"$f":"IF(ISBLANK('FY22-23 Work Plan'!A46),\"\",'FY22-23 Work Plan'!A46)","v":""},{"$f":"IF(ISBLANK('FY22-23 Work Plan'!D46),\"\",'FY22-23 Work Plan'!D46)","v":""},{"$f":"IF(ISBLANK('FY22-23 Work Plan'!E46),\"\",'FY22-23 Work Plan'!E46)","v":""},{"$f":"IF(ISBLANK('FY22-23 Work Plan'!F46),\"\",'FY22-23 Work Plan'!F46)","v":""},{"$f":"IF(ISBLANK('FY22-23 Work Plan'!H46),\"\",'FY22-23 Work Plan'!H46)","v":""},{"$f":"IF(ISBLANK('FY22-23 Work Plan'!I46),\"\",'FY22-23 Work Plan'!I46)","v":""},{"$f":"IF(ISBLANK('FY22-23 Work Plan'!J46),\"\",'FY22-23 Work Plan'!J46)","v":""},{"$f":"IF(ISBLANK('FY22-23 Work Plan'!K46),\"\",'FY22-23 Work Plan'!K46)","v":""},{"$f":"IF(ISBLANK('FY22-23 Work Plan'!L46),\"\",'FY22-23 Work Plan'!L46)","v":""}]
[{"$f":"IF(ISBLANK('FY22-23 Work Plan'!$E$2:$E$2),\"\",'FY22-23 Work Plan'!$E$2:$E$2)","v":"Asian American Drug Abuse Programs, Inc. (AADAP)"},{"$f":"IF(ISBLANK('FY22-23 Work Plan'!$J$2:$J$2),\"\",'FY22-23 Work Plan'!$J$2:$J$2)","v":"Prevention Education Program (PEP)"},{"$f":"IF(ISBLANK('FY22-23 Work Plan'!$J$3:$J$3),\"\",'FY22-23 Work Plan'!$J$3:$J$3)","v":""},{"$f":"IF(ISBLANK('FY22-23 Work Plan'!$E$3:$E$3),\"\",'FY22-23 Work Plan'!$E$3:$E$3)","v":"PH-004367"},{"$f":"IF(ISBLANK('FY22-23 Work Plan'!$E$4:$E$4),\"\",TEXT('FY22-23 Work Plan'!$E$4:$E$4,\"000000\"))","v":"000001"},{"$f":"IF(ISBLANK('FY22-23 Work Plan'!$J$4:$J$4),\"\",'FY22-23 Work Plan'!$J$4:$J$4)","v":"Building Skills"},{"$f":"IF(ISBLANK('FY22-23 Work Plan'!$E$5:$E$5),\"\",'FY22-23 Work Plan'!$E$5:$E$5)","v":"2 - San Fernando Valley"},{"$f":"IF(ISBLANK('FY22-23 Work Plan'!$J$5:$J$5),\"\",'FY22-23 Work Plan'!$J$5:$J$5)","v":"3rd District, 4th District"},{"$f":"IF(ISBLANK('FY22-23 Work Plan'!$E$6:$E$6),\"\",'FY22-23 Work Plan'!$E$6:$E$6)","v":"Angeles National Forest*, Artesia, Altadena*"},{"$f":"IF(ISBLANK('FY22-23 Work Plan'!$E$7:$E$7),\"\",'FY22-23 Work Plan'!$E$7:$E$7)","v":"Cadillac-Corning, Angeles National Forest"},{"$f":"IF(ISBLANK('FY22-23 Work Plan'!$E$8:$E$8),\"\",'FY22-23 Work Plan'!$E$8:$E$8)","v":"90032, 90036"},{"$f":"IF(ISBLANK('FY22-23 Work Plan'!$E$9:$E$9),\"\",'FY22-23 Work Plan'!$E$9:$E$9)","v":"123 E Main St., Suite 100 \nAnytown, CA 90000"},{"$f":"IF(ISBLANK('FY22-23 Work Plan'!$J$9:$J$9),\"\",TEXT('FY22-23 Work Plan'!$J$9:$J$9,\"###-###-####\"))","v":"999-999-9999"},{"$f":"IF(ISBLANK('FY22-23 Work Plan'!$J$10:$J$10),\"\",'FY22-23 Work Plan'!$J$10:$J$10)","v":"www.abc1.org"},{"$f":"IF(ISBLANK('FY22-23 Work Plan'!$E$11:$E$11),\"\",'FY22-23 Work Plan'!$E$11:$E$11)","v":"123 E Main St., Suite 100 \nAnytown, CA 90000"},{"$f":"IF(ISBLANK('FY22-23 Work Plan'!$J$11:$J$11),\"\",TEXT('FY22-23 Work Plan'!$J$11:$J$11,\"###-###-####\"))","v":"999-999-9999"},{"$f":"IF(ISBLANK('FY22-23 Work Plan'!$J$12:$J$12),\"\",'FY22-23 Work Plan'!$J$12:$J$12)","v":"www.abc2.org"},{"$f":"IF(ISBLANK('FY22-23 Work Plan'!$E$15:$E$15),\"\",'FY22-23 Work Plan'!$E$15:$E$15)","v":"John/Jane Doe"},{"$f":"IF(ISBLANK('FY22-23 Work Plan'!$H$15:$H$15),\"\",TEXT('FY22-23 Work Plan'!$H$15:$H$15,\"###-###-####\"))","v":"213-555-1212"},{"$f":"IF(ISBLANK('FY22-23 Work Plan'!$J$15:$J$15),\"\",'FY22-23 Work Plan'!$J$15:$J$15)","v":"janedoe@preventionusa.com"},{"$f":"IF(ISBLANK('FY22-23 Work Plan'!$E$16:$E$16),\"\",'FY22-23 Work Plan'!$E$16:$E$16)","v":"John/Jane Doe"},{"$f":"IF(ISBLANK('FY22-23 Work Plan'!$H$16:$H$16),\"\",TEXT('FY22-23 Work Plan'!$H$16:$H$16,\"###-###-####\"))","v":"213-555-1212"},{"$f":"IF(ISBLANK('FY22-23 Work Plan'!$J$16:$J$16),\"\",'FY22-23 Work Plan'!$J$16:$J$16)","v":"janedoe@preventionusa.com"},{"$f":"IF(ISBLANK('FY22-23 Work Plan'!$E$17:$E$17),\"\",'FY22-23 Work Plan'!$E$17:$E$17)","v":"John/Jane Doe"},{"$f":"IF(ISBLANK('FY22-23 Work Plan'!$H$17:$H$17),\"\",TEXT('FY22-23 Work Plan'!$H$17:$H$17,\"###-###-####\"))","v":"213-555-1212"},{"$f":"IF(ISBLANK('FY22-23 Work Plan'!$J$17:$J$17),\"\",'FY22-23 Work Plan'!$J$17:$J$17)","v":"j.doe@preventionusa.com"},{"$f":"IF(ISBLANK('FY22-23 Work Plan'!$E$18:$E$18),\"\",'FY22-23 Work Plan'!$E$18:$E$18)","v":"John/Jane Doe"},{"$f":"IF(ISBLANK('FY22-23 Work Plan'!$H$18:$H$18),\"\",TEXT('FY22-23 Work Plan'!$H$18:$H$18,\"###-###-####\"))","v":"213-555-1213"},{"$f":"IF(ISBLANK('FY22-23 Work Plan'!$J$18:$J$18),\"\",'FY22-23 Work Plan'!$J$18:$J$18)","v":"j.doe@preventionusa.com"},{"$f":"IF(ISBLANK('FY22-23 Work Plan'!$E$19:$E$19),\"\",'FY22-23 Work Plan'!$E$19:$E$19)","v":"John/Jane Doe"},{"$f":"IF(ISBLANK('FY22-23 Work Plan'!$H$19:$H$19),\"\",TEXT('FY22-23 Work Plan'!$H$19:$H$19,\"###-###-####\"))","v":"213-555-1213"},{"$f":"IF(ISBLANK('FY22-23 Work Plan'!$J$19:$J$19),\"\",'FY22-23 Work Plan'!$J$19:$J$19)","v":"j.doe@preventionusa.com"},{"$f":"IF(ISBLANK('FY22-23 Work Plan'!$D$23:$D$23),\"\",'FY22-23 Work Plan'!$D$23:$D$23)","v":""},{"$f":"IF(ISBLANK('FY22-23 Work Plan'!$H$23:$H$23),\"\",'FY22-23 Work Plan'!$H$23:$H$23)","v":""},{"$f":"IF(ISBLANK('FY22-23 Work Plan'!$D$24:$D$24),\"\",'FY22-23 Work Plan'!$D$24:$D$24)","v":""},{"$f":"IF(ISBLANK('FY22-23 Work Plan'!$H$24:$H$24),\"\",'FY22-23 Work Plan'!$H$24:$H$24)","v":""},{"$f":"IF(ISBLANK('FY22-23 Work Plan'!$D$25:$D$25),\"\",'FY22-23 Work Plan'!$D$25:$D$25)","v":""},{"$f":"IF(ISBLANK('FY22-23 Work Plan'!$H$25:$H$25),\"\",'FY22-23 Work Plan'!$H$25:$H$25)","v":""},{"$f":"IF(ISBLANK('FY22-23 Work Plan'!$D$26:$D$26),\"\",'FY22-23 Work Plan'!$D$26:$D$26)","v":""},{"$f":"IF(ISBLANK('FY22-23 Work Plan'!$H$26:$H$26),\"\",'FY22-23 Work Plan'!$H$26:$H$26)","v":""},{"$f":"IF(ISBLANK('FY22-23 Work Plan'!$D$27:$D$27),\"\",'FY22-23 Work Plan'!$D$27:$D$27)","v":""},{"$f":"IF(ISBLANK('FY22-23 Work Plan'!$H$27:$H$27),\"\",'FY22-23 Work Plan'!$H$27:$H$27)","v":""},{"$f":"IF(ISBLANK('FY22-23 Work Plan'!$D$28:$D$28),\"\",'FY22-23 Work Plan'!$D$28:$D$28)","v":""},{"$f":"IF(ISBLANK('FY22-23 Work Plan'!$H$28:$H$28),\"\",'FY22-23 Work Plan'!$H$28:$H$28)","v":""},{"$f":"IF(ISBLANK('FY22-23 Work Plan'!$D$29:$D$29),\"\",'FY22-23 Work Plan'!$D$29:$D$29)","v":""},{"$f":"IF(ISBLANK('FY22-23 Work Plan'!$H$29:$H$29),\"\",'FY22-23 Work Plan'!$H$29:$H$29)","v":""},{"$f":"IF(ISBLANK('FY22-23 Work Plan'!$B$30:$B$30),\"\",'FY22-23 Work Plan'!$B$30:$B$30)","v":""},{"$f":"IF(ISBLANK('FY22-23 Work Plan'!$D$30:$D$30),\"\",'FY22-23 Work Plan'!$D$30:$D$30)","v":""},{"$f":"IF(ISBLANK('FY22-23 Work Plan'!$H$30:$H$30),\"\",'FY22-23 Work Plan'!$H$30:$H$30)","v":""},{"$f":"IF(ISBLANK('FY22-23 Work Plan'!$B$31:$B$31),\"\",'FY22-23 Work Plan'!$B$31:$B$31)","v":""},{"$f":"IF(ISBLANK('FY22-23 Work Plan'!$D$31:$D$31),\"\",'FY22-23 Work Plan'!$D$31:$D$31)","v":""},{"$f":"IF(ISBLANK('FY22-23 Work Plan'!$H$31:$H$31),\"\",'FY22-23 Work Plan'!$H$31:$H$31)","v":""},{"$f":"IF(ISBLANK('FY22-23 Work Plan'!$B$32:$B$32),\"\",'FY22-23 Work Plan'!$B$32:$B$32)","v":""},{"$f":"IF(ISBLANK('FY22-23 Work Plan'!$D$32:$D$32),\"\",'FY22-23 Work Plan'!$D$32:$D$32)","v":""},{"$f":"IF(ISBLANK('FY22-23 Work Plan'!$H$32:$H$32),\"\",'FY22-23 Work Plan'!$H$32:$H$32)","v":""},{"$f":"IF(ISBLANK('FY22-23 Work Plan'!A47),\"\",'FY22-23 Work Plan'!A47)","v":""},{"$f":"IF(ISBLANK('FY22-23 Work Plan'!D47),\"\",'FY22-23 Work Plan'!D47)","v":""},{"$f":"IF(ISBLANK('FY22-23 Work Plan'!E47),\"\",'FY22-23 Work Plan'!E47)","v":""},{"$f":"IF(ISBLANK('FY22-23 Work Plan'!F47),\"\",'FY22-23 Work Plan'!F47)","v":""},{"$f":"IF(ISBLANK('FY22-23 Work Plan'!H47),\"\",'FY22-23 Work Plan'!H47)","v":""},{"$f":"IF(ISBLANK('FY22-23 Work Plan'!I47),\"\",'FY22-23 Work Plan'!I47)","v":""},{"$f":"IF(ISBLANK('FY22-23 Work Plan'!J47),\"\",'FY22-23 Work Plan'!J47)","v":""},{"$f":"IF(ISBLANK('FY22-23 Work Plan'!K47),\"\",'FY22-23 Work Plan'!K47)","v":""},{"$f":"IF(ISBLANK('FY22-23 Work Plan'!L47),\"\",'FY22-23 Work Plan'!L47)","v":""}]
[{"$f":"IF(ISBLANK('FY22-23 Work Plan'!$E$2:$E$2),\"\",'FY22-23 Work Plan'!$E$2:$E$2)","v":"Asian American Drug Abuse Programs, Inc. (AADAP)"},{"$f":"IF(ISBLANK('FY22-23 Work Plan'!$J$2:$J$2),\"\",'FY22-23 Work Plan'!$J$2:$J$2)","v":"Prevention Education Program (PEP)"},{"$f":"IF(ISBLANK('FY22-23 Work Plan'!$J$3:$J$3),\"\",'FY22-23 Work Plan'!$J$3:$J$3)","v":""},{"$f":"IF(ISBLANK('FY22-23 Work Plan'!$E$3:$E$3),\"\",'FY22-23 Work Plan'!$E$3:$E$3)","v":"PH-004367"},{"$f":"IF(ISBLANK('FY22-23 Work Plan'!$E$4:$E$4),\"\",TEXT('FY22-23 Work Plan'!$E$4:$E$4,\"000000\"))","v":"000001"},{"$f":"IF(ISBLANK('FY22-23 Work Plan'!$J$4:$J$4),\"\",'FY22-23 Work Plan'!$J$4:$J$4)","v":"Building Skills"},{"$f":"IF(ISBLANK('FY22-23 Work Plan'!$E$5:$E$5),\"\",'FY22-23 Work Plan'!$E$5:$E$5)","v":"2 - San Fernando Valley"},{"$f":"IF(ISBLANK('FY22-23 Work Plan'!$J$5:$J$5),\"\",'FY22-23 Work Plan'!$J$5:$J$5)","v":"3rd District, 4th District"},{"$f":"IF(ISBLANK('FY22-23 Work Plan'!$E$6:$E$6),\"\",'FY22-23 Work Plan'!$E$6:$E$6)","v":"Angeles National Forest*, Artesia, Altadena*"},{"$f":"IF(ISBLANK('FY22-23 Work Plan'!$E$7:$E$7),\"\",'FY22-23 Work Plan'!$E$7:$E$7)","v":"Cadillac-Corning, Angeles National Forest"},{"$f":"IF(ISBLANK('FY22-23 Work Plan'!$E$8:$E$8),\"\",'FY22-23 Work Plan'!$E$8:$E$8)","v":"90032, 90036"},{"$f":"IF(ISBLANK('FY22-23 Work Plan'!$E$9:$E$9),\"\",'FY22-23 Work Plan'!$E$9:$E$9)","v":"123 E Main St., Suite 100 \nAnytown, CA 90000"},{"$f":"IF(ISBLANK('FY22-23 Work Plan'!$J$9:$J$9),\"\",TEXT('FY22-23 Work Plan'!$J$9:$J$9,\"###-###-####\"))","v":"999-999-9999"},{"$f":"IF(ISBLANK('FY22-23 Work Plan'!$J$10:$J$10),\"\",'FY22-23 Work Plan'!$J$10:$J$10)","v":"www.abc1.org"},{"$f":"IF(ISBLANK('FY22-23 Work Plan'!$E$11:$E$11),\"\",'FY22-23 Work Plan'!$E$11:$E$11)","v":"123 E Main St., Suite 100 \nAnytown, CA 90000"},{"$f":"IF(ISBLANK('FY22-23 Work Plan'!$J$11:$J$11),\"\",TEXT('FY22-23 Work Plan'!$J$11:$J$11,\"###-###-####\"))","v":"999-999-9999"},{"$f":"IF(ISBLANK('FY22-23 Work Plan'!$J$12:$J$12),\"\",'FY22-23 Work Plan'!$J$12:$J$12)","v":"www.abc2.org"},{"$f":"IF(ISBLANK('FY22-23 Work Plan'!$E$15:$E$15),\"\",'FY22-23 Work Plan'!$E$15:$E$15)","v":"John/Jane Doe"},{"$f":"IF(ISBLANK('FY22-23 Work Plan'!$H$15:$H$15),\"\",TEXT('FY22-23 Work Plan'!$H$15:$H$15,\"###-###-####\"))","v":"213-555-1212"},{"$f":"IF(ISBLANK('FY22-23 Work Plan'!$J$15:$J$15),\"\",'FY22-23 Work Plan'!$J$15:$J$15)","v":"janedoe@preventionusa.com"},{"$f":"IF(ISBLANK('FY22-23 Work Plan'!$E$16:$E$16),\"\",'FY22-23 Work Plan'!$E$16:$E$16)","v":"John/Jane Doe"},{"$f":"IF(ISBLANK('FY22-23 Work Plan'!$H$16:$H$16),\"\",TEXT('FY22-23 Work Plan'!$H$16:$H$16,\"###-###-####\"))","v":"213-555-1212"},{"$f":"IF(ISBLANK('FY22-23 Work Plan'!$J$16:$J$16),\"\",'FY22-23 Work Plan'!$J$16:$J$16)","v":"janedoe@preventionusa.com"},{"$f":"IF(ISBLANK('FY22-23 Work Plan'!$E$17:$E$17),\"\",'FY22-23 Work Plan'!$E$17:$E$17)","v":"John/Jane Doe"},{"$f":"IF(ISBLANK('FY22-23 Work Plan'!$H$17:$H$17),\"\",TEXT('FY22-23 Work Plan'!$H$17:$H$17,\"###-###-####\"))","v":"213-555-1212"},{"$f":"IF(ISBLANK('FY22-23 Work Plan'!$J$17:$J$17),\"\",'FY22-23 Work Plan'!$J$17:$J$17)","v":"j.doe@preventionusa.com"},{"$f":"IF(ISBLANK('FY22-23 Work Plan'!$E$18:$E$18),\"\",'FY22-23 Work Plan'!$E$18:$E$18)","v":"John/Jane Doe"},{"$f":"IF(ISBLANK('FY22-23 Work Plan'!$H$18:$H$18),\"\",TEXT('FY22-23 Work Plan'!$H$18:$H$18,\"###-###-####\"))","v":"213-555-1213"},{"$f":"IF(ISBLANK('FY22-23 Work Plan'!$J$18:$J$18),\"\",'FY22-23 Work Plan'!$J$18:$J$18)","v":"j.doe@preventionusa.com"},{"$f":"IF(ISBLANK('FY22-23 Work Plan'!$E$19:$E$19),\"\",'FY22-23 Work Plan'!$E$19:$E$19)","v":"John/Jane Doe"},{"$f":"IF(ISBLANK('FY22-23 Work Plan'!$H$19:$H$19),\"\",TEXT('FY22-23 Work Plan'!$H$19:$H$19,\"###-###-####\"))","v":"213-555-1213"},{"$f":"IF(ISBLANK('FY22-23 Work Plan'!$J$19:$J$19),\"\",'FY22-23 Work Plan'!$J$19:$J$19)","v":"j.doe@preventionusa.com"},{"$f":"IF(ISBLANK('FY22-23 Work Plan'!$D$23:$D$23),\"\",'FY22-23 Work Plan'!$D$23:$D$23)","v":""},{"$f":"IF(ISBLANK('FY22-23 Work Plan'!$H$23:$H$23),\"\",'FY22-23 Work Plan'!$H$23:$H$23)","v":""},{"$f":"IF(ISBLANK('FY22-23 Work Plan'!$D$24:$D$24),\"\",'FY22-23 Work Plan'!$D$24:$D$24)","v":""},{"$f":"IF(ISBLANK('FY22-23 Work Plan'!$H$24:$H$24),\"\",'FY22-23 Work Plan'!$H$24:$H$24)","v":""},{"$f":"IF(ISBLANK('FY22-23 Work Plan'!$D$25:$D$25),\"\",'FY22-23 Work Plan'!$D$25:$D$25)","v":""},{"$f":"IF(ISBLANK('FY22-23 Work Plan'!$H$25:$H$25),\"\",'FY22-23 Work Plan'!$H$25:$H$25)","v":""},{"$f":"IF(ISBLANK('FY22-23 Work Plan'!$D$26:$D$26),\"\",'FY22-23 Work Plan'!$D$26:$D$26)","v":""},{"$f":"IF(ISBLANK('FY22-23 Work Plan'!$H$26:$H$26),\"\",'FY22-23 Work Plan'!$H$26:$H$26)","v":""},{"$f":"IF(ISBLANK('FY22-23 Work Plan'!$D$27:$D$27),\"\",'FY22-23 Work Plan'!$D$27:$D$27)","v":""},{"$f":"IF(ISBLANK('FY22-23 Work Plan'!$H$27:$H$27),\"\",'FY22-23 Work Plan'!$H$27:$H$27)","v":""},{"$f":"IF(ISBLANK('FY22-23 Work Plan'!$D$28:$D$28),\"\",'FY22-23 Work Plan'!$D$28:$D$28)","v":""},{"$f":"IF(ISBLANK('FY22-23 Work Plan'!$H$28:$H$28),\"\",'FY22-23 Work Plan'!$H$28:$H$28)","v":""},{"$f":"IF(ISBLANK('FY22-23 Work Plan'!$D$29:$D$29),\"\",'FY22-23 Work Plan'!$D$29:$D$29)","v":""},{"$f":"IF(ISBLANK('FY22-23 Work Plan'!$H$29:$H$29),\"\",'FY22-23 Work Plan'!$H$29:$H$29)","v":""},{"$f":"IF(ISBLANK('FY22-23 Work Plan'!$B$30:$B$30),\"\",'FY22-23 Work Plan'!$B$30:$B$30)","v":""},{"$f":"IF(ISBLANK('FY22-23 Work Plan'!$D$30:$D$30),\"\",'FY22-23 Work Plan'!$D$30:$D$30)","v":""},{"$f":"IF(ISBLANK('FY22-23 Work Plan'!$H$30:$H$30),\"\",'FY22-23 Work Plan'!$H$30:$H$30)","v":""},{"$f":"IF(ISBLANK('FY22-23 Work Plan'!$B$31:$B$31),\"\",'FY22-23 Work Plan'!$B$31:$B$31)","v":""},{"$f":"IF(ISBLANK('FY22-23 Work Plan'!$D$31:$D$31),\"\",'FY22-23 Work Plan'!$D$31:$D$31)","v":""},{"$f":"IF(ISBLANK('FY22-23 Work Plan'!$H$31:$H$31),\"\",'FY22-23 Work Plan'!$H$31:$H$31)","v":""},{"$f":"IF(ISBLANK('FY22-23 Work Plan'!$B$32:$B$32),\"\",'FY22-23 Work Plan'!$B$32:$B$32)","v":""},{"$f":"IF(ISBLANK('FY22-23 Work Plan'!$D$32:$D$32),\"\",'FY22-23 Work Plan'!$D$32:$D$32)","v":""},{"$f":"IF(ISBLANK('FY22-23 Work Plan'!$H$32:$H$32),\"\",'FY22-23 Work Plan'!$H$32:$H$32)","v":""},{"$f":"IF(ISBLANK('FY22-23 Work Plan'!A48),\"\",'FY22-23 Work Plan'!A48)","v":""},{"$f":"IF(ISBLANK('FY22-23 Work Plan'!D48),\"\",'FY22-23 Work Plan'!D48)","v":""},{"$f":"IF(ISBLANK('FY22-23 Work Plan'!E48),\"\",'FY22-23 Work Plan'!E48)","v":""},{"$f":"IF(ISBLANK('FY22-23 Work Plan'!F48),\"\",'FY22-23 Work Plan'!F48)","v":""},{"$f":"IF(ISBLANK('FY22-23 Work Plan'!H48),\"\",'FY22-23 Work Plan'!H48)","v":""},{"$f":"IF(ISBLANK('FY22-23 Work Plan'!I48),\"\",'FY22-23 Work Plan'!I48)","v":""},{"$f":"IF(ISBLANK('FY22-23 Work Plan'!J48),\"\",'FY22-23 Work Plan'!J48)","v":""},{"$f":"IF(ISBLANK('FY22-23 Work Plan'!K48),\"\",'FY22-23 Work Plan'!K48)","v":""},{"$f":"IF(ISBLANK('FY22-23 Work Plan'!L48),\"\",'FY22-23 Work Plan'!L48)","v":""}]
[{"$f":"IF(ISBLANK('FY22-23 Work Plan'!$E$2:$E$2),\"\",'FY22-23 Work Plan'!$E$2:$E$2)","v":"Asian American Drug Abuse Programs, Inc. (AADAP)"},{"$f":"IF(ISBLANK('FY22-23 Work Plan'!$J$2:$J$2),\"\",'FY22-23 Work Plan'!$J$2:$J$2)","v":"Prevention Education Program (PEP)"},{"$f":"IF(ISBLANK('FY22-23 Work Plan'!$J$3:$J$3),\"\",'FY22-23 Work Plan'!$J$3:$J$3)","v":""},{"$f":"IF(ISBLANK('FY22-23 Work Plan'!$E$3:$E$3),\"\",'FY22-23 Work Plan'!$E$3:$E$3)","v":"PH-004367"},{"$f":"IF(ISBLANK('FY22-23 Work Plan'!$E$4:$E$4),\"\",TEXT('FY22-23 Work Plan'!$E$4:$E$4,\"000000\"))","v":"000001"},{"$f":"IF(ISBLANK('FY22-23 Work Plan'!$J$4:$J$4),\"\",'FY22-23 Work Plan'!$J$4:$J$4)","v":"Building Skills"},{"$f":"IF(ISBLANK('FY22-23 Work Plan'!$E$5:$E$5),\"\",'FY22-23 Work Plan'!$E$5:$E$5)","v":"2 - San Fernando Valley"},{"$f":"IF(ISBLANK('FY22-23 Work Plan'!$J$5:$J$5),\"\",'FY22-23 Work Plan'!$J$5:$J$5)","v":"3rd District, 4th District"},{"$f":"IF(ISBLANK('FY22-23 Work Plan'!$E$6:$E$6),\"\",'FY22-23 Work Plan'!$E$6:$E$6)","v":"Angeles National Forest*, Artesia, Altadena*"},{"$f":"IF(ISBLANK('FY22-23 Work Plan'!$E$7:$E$7),\"\",'FY22-23 Work Plan'!$E$7:$E$7)","v":"Cadillac-Corning, Angeles National Forest"},{"$f":"IF(ISBLANK('FY22-23 Work Plan'!$E$8:$E$8),\"\",'FY22-23 Work Plan'!$E$8:$E$8)","v":"90032, 90036"},{"$f":"IF(ISBLANK('FY22-23 Work Plan'!$E$9:$E$9),\"\",'FY22-23 Work Plan'!$E$9:$E$9)","v":"123 E Main St., Suite 100 \nAnytown, CA 90000"},{"$f":"IF(ISBLANK('FY22-23 Work Plan'!$J$9:$J$9),\"\",TEXT('FY22-23 Work Plan'!$J$9:$J$9,\"###-###-####\"))","v":"999-999-9999"},{"$f":"IF(ISBLANK('FY22-23 Work Plan'!$J$10:$J$10),\"\",'FY22-23 Work Plan'!$J$10:$J$10)","v":"www.abc1.org"},{"$f":"IF(ISBLANK('FY22-23 Work Plan'!$E$11:$E$11),\"\",'FY22-23 Work Plan'!$E$11:$E$11)","v":"123 E Main St., Suite 100 \nAnytown, CA 90000"},{"$f":"IF(ISBLANK('FY22-23 Work Plan'!$J$11:$J$11),\"\",TEXT('FY22-23 Work Plan'!$J$11:$J$11,\"###-###-####\"))","v":"999-999-9999"},{"$f":"IF(ISBLANK('FY22-23 Work Plan'!$J$12:$J$12),\"\",'FY22-23 Work Plan'!$J$12:$J$12)","v":"www.abc2.org"},{"$f":"IF(ISBLANK('FY22-23 Work Plan'!$E$15:$E$15),\"\",'FY22-23 Work Plan'!$E$15:$E$15)","v":"John/Jane Doe"},{"$f":"IF(ISBLANK('FY22-23 Work Plan'!$H$15:$H$15),\"\",TEXT('FY22-23 Work Plan'!$H$15:$H$15,\"###-###-####\"))","v":"213-555-1212"},{"$f":"IF(ISBLANK('FY22-23 Work Plan'!$J$15:$J$15),\"\",'FY22-23 Work Plan'!$J$15:$J$15)","v":"janedoe@preventionusa.com"},{"$f":"IF(ISBLANK('FY22-23 Work Plan'!$E$16:$E$16),\"\",'FY22-23 Work Plan'!$E$16:$E$16)","v":"John/Jane Doe"},{"$f":"IF(ISBLANK('FY22-23 Work Plan'!$H$16:$H$16),\"\",TEXT('FY22-23 Work Plan'!$H$16:$H$16,\"###-###-####\"))","v":"213-555-1212"},{"$f":"IF(ISBLANK('FY22-23 Work Plan'!$J$16:$J$16),\"\",'FY22-23 Work Plan'!$J$16:$J$16)","v":"janedoe@preventionusa.com"},{"$f":"IF(ISBLANK('FY22-23 Work Plan'!$E$17:$E$17),\"\",'FY22-23 Work Plan'!$E$17:$E$17)","v":"John/Jane Doe"},{"$f":"IF(ISBLANK('FY22-23 Work Plan'!$H$17:$H$17),\"\",TEXT('FY22-23 Work Plan'!$H$17:$H$17,\"###-###-####\"))","v":"213-555-1212"},{"$f":"IF(ISBLANK('FY22-23 Work Plan'!$J$17:$J$17),\"\",'FY22-23 Work Plan'!$J$17:$J$17)","v":"j.doe@preventionusa.com"},{"$f":"IF(ISBLANK('FY22-23 Work Plan'!$E$18:$E$18),\"\",'FY22-23 Work Plan'!$E$18:$E$18)","v":"John/Jane Doe"},{"$f":"IF(ISBLANK('FY22-23 Work Plan'!$H$18:$H$18),\"\",TEXT('FY22-23 Work Plan'!$H$18:$H$18,\"###-###-####\"))","v":"213-555-1213"},{"$f":"IF(ISBLANK('FY22-23 Work Plan'!$J$18:$J$18),\"\",'FY22-23 Work Plan'!$J$18:$J$18)","v":"j.doe@preventionusa.com"},{"$f":"IF(ISBLANK('FY22-23 Work Plan'!$E$19:$E$19),\"\",'FY22-23 Work Plan'!$E$19:$E$19)","v":"John/Jane Doe"},{"$f":"IF(ISBLANK('FY22-23 Work Plan'!$H$19:$H$19),\"\",TEXT('FY22-23 Work Plan'!$H$19:$H$19,\"###-###-####\"))","v":"213-555-1213"},{"$f":"IF(ISBLANK('FY22-23 Work Plan'!$J$19:$J$19),\"\",'FY22-23 Work Plan'!$J$19:$J$19)","v":"j.doe@preventionusa.com"},{"$f":"IF(ISBLANK('FY22-23 Work Plan'!$D$23:$D$23),\"\",'FY22-23 Work Plan'!$D$23:$D$23)","v":""},{"$f":"IF(ISBLANK('FY22-23 Work Plan'!$H$23:$H$23),\"\",'FY22-23 Work Plan'!$H$23:$H$23)","v":""},{"$f":"IF(ISBLANK('FY22-23 Work Plan'!$D$24:$D$24),\"\",'FY22-23 Work Plan'!$D$24:$D$24)","v":""},{"$f":"IF(ISBLANK('FY22-23 Work Plan'!$H$24:$H$24),\"\",'FY22-23 Work Plan'!$H$24:$H$24)","v":""},{"$f":"IF(ISBLANK('FY22-23 Work Plan'!$D$25:$D$25),\"\",'FY22-23 Work Plan'!$D$25:$D$25)","v":""},{"$f":"IF(ISBLANK('FY22-23 Work Plan'!$H$25:$H$25),\"\",'FY22-23 Work Plan'!$H$25:$H$25)","v":""},{"$f":"IF(ISBLANK('FY22-23 Work Plan'!$D$26:$D$26),\"\",'FY22-23 Work Plan'!$D$26:$D$26)","v":""},{"$f":"IF(ISBLANK('FY22-23 Work Plan'!$H$26:$H$26),\"\",'FY22-23 Work Plan'!$H$26:$H$26)","v":""},{"$f":"IF(ISBLANK('FY22-23 Work Plan'!$D$27:$D$27),\"\",'FY22-23 Work Plan'!$D$27:$D$27)","v":""},{"$f":"IF(ISBLANK('FY22-23 Work Plan'!$H$27:$H$27),\"\",'FY22-23 Work Plan'!$H$27:$H$27)","v":""},{"$f":"IF(ISBLANK('FY22-23 Work Plan'!$D$28:$D$28),\"\",'FY22-23 Work Plan'!$D$28:$D$28)","v":""},{"$f":"IF(ISBLANK('FY22-23 Work Plan'!$H$28:$H$28),\"\",'FY22-23 Work Plan'!$H$28:$H$28)","v":""},{"$f":"IF(ISBLANK('FY22-23 Work Plan'!$D$29:$D$29),\"\",'FY22-23 Work Plan'!$D$29:$D$29)","v":""},{"$f":"IF(ISBLANK('FY22-23 Work Plan'!$H$29:$H$29),\"\",'FY22-23 Work Plan'!$H$29:$H$29)","v":""},{"$f":"IF(ISBLANK('FY22-23 Work Plan'!$B$30:$B$30),\"\",'FY22-23 Work Plan'!$B$30:$B$30)","v":""},{"$f":"IF(ISBLANK('FY22-23 Work Plan'!$D$30:$D$30),\"\",'FY22-23 Work Plan'!$D$30:$D$30)","v":""},{"$f":"IF(ISBLANK('FY22-23 Work Plan'!$H$30:$H$30),\"\",'FY22-23 Work Plan'!$H$30:$H$30)","v":""},{"$f":"IF(ISBLANK('FY22-23 Work Plan'!$B$31:$B$31),\"\",'FY22-23 Work Plan'!$B$31:$B$31)","v":""},{"$f":"IF(ISBLANK('FY22-23 Work Plan'!$D$31:$D$31),\"\",'FY22-23 Work Plan'!$D$31:$D$31)","v":""},{"$f":"IF(ISBLANK('FY22-23 Work Plan'!$H$31:$H$31),\"\",'FY22-23 Work Plan'!$H$31:$H$31)","v":""},{"$f":"IF(ISBLANK('FY22-23 Work Plan'!$B$32:$B$32),\"\",'FY22-23 Work Plan'!$B$32:$B$32)","v":""},{"$f":"IF(ISBLANK('FY22-23 Work Plan'!$D$32:$D$32),\"\",'FY22-23 Work Plan'!$D$32:$D$32)","v":""},{"$f":"IF(ISBLANK('FY22-23 Work Plan'!$H$32:$H$32),\"\",'FY22-23 Work Plan'!$H$32:$H$32)","v":""},{"$f":"IF(ISBLANK('FY22-23 Work Plan'!A49),\"\",'FY22-23 Work Plan'!A49)","v":""},{"$f":"IF(ISBLANK('FY22-23 Work Plan'!D49),\"\",'FY22-23 Work Plan'!D49)","v":""},{"$f":"IF(ISBLANK('FY22-23 Work Plan'!E49),\"\",'FY22-23 Work Plan'!E49)","v":""},{"$f":"IF(ISBLANK('FY22-23 Work Plan'!F49),\"\",'FY22-23 Work Plan'!F49)","v":""},{"$f":"IF(ISBLANK('FY22-23 Work Plan'!H49),\"\",'FY22-23 Work Plan'!H49)","v":""},{"$f":"IF(ISBLANK('FY22-23 Work Plan'!I49),\"\",'FY22-23 Work Plan'!I49)","v":""},{"$f":"IF(ISBLANK('FY22-23 Work Plan'!J49),\"\",'FY22-23 Work Plan'!J49)","v":""},{"$f":"IF(ISBLANK('FY22-23 Work Plan'!K49),\"\",'FY22-23 Work Plan'!K49)","v":""},{"$f":"IF(ISBLANK('FY22-23 Work Plan'!L49),\"\",'FY22-23 Work Plan'!L49)","v":""}]
[{"$f":"IF(ISBLANK('FY22-23 Work Plan'!$E$2:$E$2),\"\",'FY22-23 Work Plan'!$E$2:$E$2)","v":"Asian American Drug Abuse Programs, Inc. (AADAP)"},{"$f":"IF(ISBLANK('FY22-23 Work Plan'!$J$2:$J$2),\"\",'FY22-23 Work Plan'!$J$2:$J$2)","v":"Prevention Education Program (PEP)"},{"$f":"IF(ISBLANK('FY22-23 Work Plan'!$J$3:$J$3),\"\",'FY22-23 Work Plan'!$J$3:$J$3)","v":""},{"$f":"IF(ISBLANK('FY22-23 Work Plan'!$E$3:$E$3),\"\",'FY22-23 Work Plan'!$E$3:$E$3)","v":"PH-004367"},{"$f":"IF(ISBLANK('FY22-23 Work Plan'!$E$4:$E$4),\"\",TEXT('FY22-23 Work Plan'!$E$4:$E$4,\"000000\"))","v":"000001"},{"$f":"IF(ISBLANK('FY22-23 Work Plan'!$J$4:$J$4),\"\",'FY22-23 Work Plan'!$J$4:$J$4)","v":"Building Skills"},{"$f":"IF(ISBLANK('FY22-23 Work Plan'!$E$5:$E$5),\"\",'FY22-23 Work Plan'!$E$5:$E$5)","v":"2 - San Fernando Valley"},{"$f":"IF(ISBLANK('FY22-23 Work Plan'!$J$5:$J$5),\"\",'FY22-23 Work Plan'!$J$5:$J$5)","v":"3rd District, 4th District"},{"$f":"IF(ISBLANK('FY22-23 Work Plan'!$E$6:$E$6),\"\",'FY22-23 Work Plan'!$E$6:$E$6)","v":"Angeles National Forest*, Artesia, Altadena*"},{"$f":"IF(ISBLANK('FY22-23 Work Plan'!$E$7:$E$7),\"\",'FY22-23 Work Plan'!$E$7:$E$7)","v":"Cadillac-Corning, Angeles National Forest"},{"$f":"IF(ISBLANK('FY22-23 Work Plan'!$E$8:$E$8),\"\",'FY22-23 Work Plan'!$E$8:$E$8)","v":"90032, 90036"},{"$f":"IF(ISBLANK('FY22-23 Work Plan'!$E$9:$E$9),\"\",'FY22-23 Work Plan'!$E$9:$E$9)","v":"123 E Main St., Suite 100 \nAnytown, CA 90000"},{"$f":"IF(ISBLANK('FY22-23 Work Plan'!$J$9:$J$9),\"\",TEXT('FY22-23 Work Plan'!$J$9:$J$9,\"###-###-####\"))","v":"999-999-9999"},{"$f":"IF(ISBLANK('FY22-23 Work Plan'!$J$10:$J$10),\"\",'FY22-23 Work Plan'!$J$10:$J$10)","v":"www.abc1.org"},{"$f":"IF(ISBLANK('FY22-23 Work Plan'!$E$11:$E$11),\"\",'FY22-23 Work Plan'!$E$11:$E$11)","v":"123 E Main St., Suite 100 \nAnytown, CA 90000"},{"$f":"IF(ISBLANK('FY22-23 Work Plan'!$J$11:$J$11),\"\",TEXT('FY22-23 Work Plan'!$J$11:$J$11,\"###-###-####\"))","v":"999-999-9999"},{"$f":"IF(ISBLANK('FY22-23 Work Plan'!$J$12:$J$12),\"\",'FY22-23 Work Plan'!$J$12:$J$12)","v":"www.abc2.org"},{"$f":"IF(ISBLANK('FY22-23 Work Plan'!$E$15:$E$15),\"\",'FY22-23 Work Plan'!$E$15:$E$15)","v":"John/Jane Doe"},{"$f":"IF(ISBLANK('FY22-23 Work Plan'!$H$15:$H$15),\"\",TEXT('FY22-23 Work Plan'!$H$15:$H$15,\"###-###-####\"))","v":"213-555-1212"},{"$f":"IF(ISBLANK('FY22-23 Work Plan'!$J$15:$J$15),\"\",'FY22-23 Work Plan'!$J$15:$J$15)","v":"janedoe@preventionusa.com"},{"$f":"IF(ISBLANK('FY22-23 Work Plan'!$E$16:$E$16),\"\",'FY22-23 Work Plan'!$E$16:$E$16)","v":"John/Jane Doe"},{"$f":"IF(ISBLANK('FY22-23 Work Plan'!$H$16:$H$16),\"\",TEXT('FY22-23 Work Plan'!$H$16:$H$16,\"###-###-####\"))","v":"213-555-1212"},{"$f":"IF(ISBLANK('FY22-23 Work Plan'!$J$16:$J$16),\"\",'FY22-23 Work Plan'!$J$16:$J$16)","v":"janedoe@preventionusa.com"},{"$f":"IF(ISBLANK('FY22-23 Work Plan'!$E$17:$E$17),\"\",'FY22-23 Work Plan'!$E$17:$E$17)","v":"John/Jane Doe"},{"$f":"IF(ISBLANK('FY22-23 Work Plan'!$H$17:$H$17),\"\",TEXT('FY22-23 Work Plan'!$H$17:$H$17,\"###-###-####\"))","v":"213-555-1212"},{"$f":"IF(ISBLANK('FY22-23 Work Plan'!$J$17:$J$17),\"\",'FY22-23 Work Plan'!$J$17:$J$17)","v":"j.doe@preventionusa.com"},{"$f":"IF(ISBLANK('FY22-23 Work Plan'!$E$18:$E$18),\"\",'FY22-23 Work Plan'!$E$18:$E$18)","v":"John/Jane Doe"},{"$f":"IF(ISBLANK('FY22-23 Work Plan'!$H$18:$H$18),\"\",TEXT('FY22-23 Work Plan'!$H$18:$H$18,\"###-###-####\"))","v":"213-555-1213"},{"$f":"IF(ISBLANK('FY22-23 Work Plan'!$J$18:$J$18),\"\",'FY22-23 Work Plan'!$J$18:$J$18)","v":"j.doe@preventionusa.com"},{"$f":"IF(ISBLANK('FY22-23 Work Plan'!$E$19:$E$19),\"\",'FY22-23 Work Plan'!$E$19:$E$19)","v":"John/Jane Doe"},{"$f":"IF(ISBLANK('FY22-23 Work Plan'!$H$19:$H$19),\"\",TEXT('FY22-23 Work Plan'!$H$19:$H$19,\"###-###-####\"))","v":"213-555-1213"},{"$f":"IF(ISBLANK('FY22-23 Work Plan'!$J$19:$J$19),\"\",'FY22-23 Work Plan'!$J$19:$J$19)","v":"j.doe@preventionusa.com"},{"$f":"IF(ISBLANK('FY22-23 Work Plan'!$D$23:$D$23),\"\",'FY22-23 Work Plan'!$D$23:$D$23)","v":""},{"$f":"IF(ISBLANK('FY22-23 Work Plan'!$H$23:$H$23),\"\",'FY22-23 Work Plan'!$H$23:$H$23)","v":""},{"$f":"IF(ISBLANK('FY22-23 Work Plan'!$D$24:$D$24),\"\",'FY22-23 Work Plan'!$D$24:$D$24)","v":""},{"$f":"IF(ISBLANK('FY22-23 Work Plan'!$H$24:$H$24),\"\",'FY22-23 Work Plan'!$H$24:$H$24)","v":""},{"$f":"IF(ISBLANK('FY22-23 Work Plan'!$D$25:$D$25),\"\",'FY22-23 Work Plan'!$D$25:$D$25)","v":""},{"$f":"IF(ISBLANK('FY22-23 Work Plan'!$H$25:$H$25),\"\",'FY22-23 Work Plan'!$H$25:$H$25)","v":""},{"$f":"IF(ISBLANK('FY22-23 Work Plan'!$D$26:$D$26),\"\",'FY22-23 Work Plan'!$D$26:$D$26)","v":""},{"$f":"IF(ISBLANK('FY22-23 Work Plan'!$H$26:$H$26),\"\",'FY22-23 Work Plan'!$H$26:$H$26)","v":""},{"$f":"IF(ISBLANK('FY22-23 Work Plan'!$D$27:$D$27),\"\",'FY22-23 Work Plan'!$D$27:$D$27)","v":""},{"$f":"IF(ISBLANK('FY22-23 Work Plan'!$H$27:$H$27),\"\",'FY22-23 Work Plan'!$H$27:$H$27)","v":""},{"$f":"IF(ISBLANK('FY22-23 Work Plan'!$D$28:$D$28),\"\",'FY22-23 Work Plan'!$D$28:$D$28)","v":""},{"$f":"IF(ISBLANK('FY22-23 Work Plan'!$H$28:$H$28),\"\",'FY22-23 Work Plan'!$H$28:$H$28)","v":""},{"$f":"IF(ISBLANK('FY22-23 Work Plan'!$D$29:$D$29),\"\",'FY22-23 Work Plan'!$D$29:$D$29)","v":""},{"$f":"IF(ISBLANK('FY22-23 Work Plan'!$H$29:$H$29),\"\",'FY22-23 Work Plan'!$H$29:$H$29)","v":""},{"$f":"IF(ISBLANK('FY22-23 Work Plan'!$B$30:$B$30),\"\",'FY22-23 Work Plan'!$B$30:$B$30)","v":""},{"$f":"IF(ISBLANK('FY22-23 Work Plan'!$D$30:$D$30),\"\",'FY22-23 Work Plan'!$D$30:$D$30)","v":""},{"$f":"IF(ISBLANK('FY22-23 Work Plan'!$H$30:$H$30),\"\",'FY22-23 Work Plan'!$H$30:$H$30)","v":""},{"$f":"IF(ISBLANK('FY22-23 Work Plan'!$B$31:$B$31),\"\",'FY22-23 Work Plan'!$B$31:$B$31)","v":""},{"$f":"IF(ISBLANK('FY22-23 Work Plan'!$D$31:$D$31),\"\",'FY22-23 Work Plan'!$D$31:$D$31)","v":""},{"$f":"IF(ISBLANK('FY22-23 Work Plan'!$H$31:$H$31),\"\",'FY22-23 Work Plan'!$H$31:$H$31)","v":""},{"$f":"IF(ISBLANK('FY22-23 Work Plan'!$B$32:$B$32),\"\",'FY22-23 Work Plan'!$B$32:$B$32)","v":""},{"$f":"IF(ISBLANK('FY22-23 Work Plan'!$D$32:$D$32),\"\",'FY22-23 Work Plan'!$D$32:$D$32)","v":""},{"$f":"IF(ISBLANK('FY22-23 Work Plan'!$H$32:$H$32),\"\",'FY22-23 Work Plan'!$H$32:$H$32)","v":""},{"$f":"IF(ISBLANK('FY22-23 Work Plan'!A50),\"\",'FY22-23 Work Plan'!A50)","v":""},{"$f":"IF(ISBLANK('FY22-23 Work Plan'!D50),\"\",'FY22-23 Work Plan'!D50)","v":""},{"$f":"IF(ISBLANK('FY22-23 Work Plan'!E50),\"\",'FY22-23 Work Plan'!E50)","v":""},{"$f":"IF(ISBLANK('FY22-23 Work Plan'!F50),\"\",'FY22-23 Work Plan'!F50)","v":""},{"$f":"IF(ISBLANK('FY22-23 Work Plan'!H50),\"\",'FY22-23 Work Plan'!H50)","v":""},{"$f":"IF(ISBLANK('FY22-23 Work Plan'!I50),\"\",'FY22-23 Work Plan'!I50)","v":""},{"$f":"IF(ISBLANK('FY22-23 Work Plan'!J50),\"\",'FY22-23 Work Plan'!J50)","v":""},{"$f":"IF(ISBLANK('FY22-23 Work Plan'!K50),\"\",'FY22-23 Work Plan'!K50)","v":""},{"$f":"IF(ISBLANK('FY22-23 Work Plan'!L50),\"\",'FY22-23 Work Plan'!L50)","v":""}]
[{"$f":"IF(ISBLANK('FY22-23 Work Plan'!$E$2:$E$2),\"\",'FY22-23 Work Plan'!$E$2:$E$2)","v":"Asian American Drug Abuse Programs, Inc. (AADAP)"},{"$f":"IF(ISBLANK('FY22-23 Work Plan'!$J$2:$J$2),\"\",'FY22-23 Work Plan'!$J$2:$J$2)","v":"Prevention Education Program (PEP)"},{"$f":"IF(ISBLANK('FY22-23 Work Plan'!$J$3:$J$3),\"\",'FY22-23 Work Plan'!$J$3:$J$3)","v":""},{"$f":"IF(ISBLANK('FY22-23 Work Plan'!$E$3:$E$3),\"\",'FY22-23 Work Plan'!$E$3:$E$3)","v":"PH-004367"},{"$f":"IF(ISBLANK('FY22-23 Work Plan'!$E$4:$E$4),\"\",TEXT('FY22-23 Work Plan'!$E$4:$E$4,\"000000\"))","v":"000001"},{"$f":"IF(ISBLANK('FY22-23 Work Plan'!$J$4:$J$4),\"\",'FY22-23 Work Plan'!$J$4:$J$4)","v":"Building Skills"},{"$f":"IF(ISBLANK('FY22-23 Work Plan'!$E$5:$E$5),\"\",'FY22-23 Work Plan'!$E$5:$E$5)","v":"2 - San Fernando Valley"},{"$f":"IF(ISBLANK('FY22-23 Work Plan'!$J$5:$J$5),\"\",'FY22-23 Work Plan'!$J$5:$J$5)","v":"3rd District, 4th District"},{"$f":"IF(ISBLANK('FY22-23 Work Plan'!$E$6:$E$6),\"\",'FY22-23 Work Plan'!$E$6:$E$6)","v":"Angeles National Forest*, Artesia, Altadena*"},{"$f":"IF(ISBLANK('FY22-23 Work Plan'!$E$7:$E$7),\"\",'FY22-23 Work Plan'!$E$7:$E$7)","v":"Cadillac-Corning, Angeles National Forest"},{"$f":"IF(ISBLANK('FY22-23 Work Plan'!$E$8:$E$8),\"\",'FY22-23 Work Plan'!$E$8:$E$8)","v":"90032, 90036"},{"$f":"IF(ISBLANK('FY22-23 Work Plan'!$E$9:$E$9),\"\",'FY22-23 Work Plan'!$E$9:$E$9)","v":"123 E Main St., Suite 100 \nAnytown, CA 90000"},{"$f":"IF(ISBLANK('FY22-23 Work Plan'!$J$9:$J$9),\"\",TEXT('FY22-23 Work Plan'!$J$9:$J$9,\"###-###-####\"))","v":"999-999-9999"},{"$f":"IF(ISBLANK('FY22-23 Work Plan'!$J$10:$J$10),\"\",'FY22-23 Work Plan'!$J$10:$J$10)","v":"www.abc1.org"},{"$f":"IF(ISBLANK('FY22-23 Work Plan'!$E$11:$E$11),\"\",'FY22-23 Work Plan'!$E$11:$E$11)","v":"123 E Main St., Suite 100 \nAnytown, CA 90000"},{"$f":"IF(ISBLANK('FY22-23 Work Plan'!$J$11:$J$11),\"\",TEXT('FY22-23 Work Plan'!$J$11:$J$11,\"###-###-####\"))","v":"999-999-9999"},{"$f":"IF(ISBLANK('FY22-23 Work Plan'!$J$12:$J$12),\"\",'FY22-23 Work Plan'!$J$12:$J$12)","v":"www.abc2.org"},{"$f":"IF(ISBLANK('FY22-23 Work Plan'!$E$15:$E$15),\"\",'FY22-23 Work Plan'!$E$15:$E$15)","v":"John/Jane Doe"},{"$f":"IF(ISBLANK('FY22-23 Work Plan'!$H$15:$H$15),\"\",TEXT('FY22-23 Work Plan'!$H$15:$H$15,\"###-###-####\"))","v":"213-555-1212"},{"$f":"IF(ISBLANK('FY22-23 Work Plan'!$J$15:$J$15),\"\",'FY22-23 Work Plan'!$J$15:$J$15)","v":"janedoe@preventionusa.com"},{"$f":"IF(ISBLANK('FY22-23 Work Plan'!$E$16:$E$16),\"\",'FY22-23 Work Plan'!$E$16:$E$16)","v":"John/Jane Doe"},{"$f":"IF(ISBLANK('FY22-23 Work Plan'!$H$16:$H$16),\"\",TEXT('FY22-23 Work Plan'!$H$16:$H$16,\"###-###-####\"))","v":"213-555-1212"},{"$f":"IF(ISBLANK('FY22-23 Work Plan'!$J$16:$J$16),\"\",'FY22-23 Work Plan'!$J$16:$J$16)","v":"janedoe@preventionusa.com"},{"$f":"IF(ISBLANK('FY22-23 Work Plan'!$E$17:$E$17),\"\",'FY22-23 Work Plan'!$E$17:$E$17)","v":"John/Jane Doe"},{"$f":"IF(ISBLANK('FY22-23 Work Plan'!$H$17:$H$17),\"\",TEXT('FY22-23 Work Plan'!$H$17:$H$17,\"###-###-####\"))","v":"213-555-1212"},{"$f":"IF(ISBLANK('FY22-23 Work Plan'!$J$17:$J$17),\"\",'FY22-23 Work Plan'!$J$17:$J$17)","v":"j.doe@preventionusa.com"},{"$f":"IF(ISBLANK('FY22-23 Work Plan'!$E$18:$E$18),\"\",'FY22-23 Work Plan'!$E$18:$E$18)","v":"John/Jane Doe"},{"$f":"IF(ISBLANK('FY22-23 Work Plan'!$H$18:$H$18),\"\",TEXT('FY22-23 Work Plan'!$H$18:$H$18,\"###-###-####\"))","v":"213-555-1213"},{"$f":"IF(ISBLANK('FY22-23 Work Plan'!$J$18:$J$18),\"\",'FY22-23 Work Plan'!$J$18:$J$18)","v":"j.doe@preventionusa.com"},{"$f":"IF(ISBLANK('FY22-23 Work Plan'!$E$19:$E$19),\"\",'FY22-23 Work Plan'!$E$19:$E$19)","v":"John/Jane Doe"},{"$f":"IF(ISBLANK('FY22-23 Work Plan'!$H$19:$H$19),\"\",TEXT('FY22-23 Work Plan'!$H$19:$H$19,\"###-###-####\"))","v":"213-555-1213"},{"$f":"IF(ISBLANK('FY22-23 Work Plan'!$J$19:$J$19),\"\",'FY22-23 Work Plan'!$J$19:$J$19)","v":"j.doe@preventionusa.com"},{"$f":"IF(ISBLANK('FY22-23 Work Plan'!$D$23:$D$23),\"\",'FY22-23 Work Plan'!$D$23:$D$23)","v":""},{"$f":"IF(ISBLANK('FY22-23 Work Plan'!$H$23:$H$23),\"\",'FY22-23 Work Plan'!$H$23:$H$23)","v":""},{"$f":"IF(ISBLANK('FY22-23 Work Plan'!$D$24:$D$24),\"\",'FY22-23 Work Plan'!$D$24:$D$24)","v":""},{"$f":"IF(ISBLANK('FY22-23 Work Plan'!$H$24:$H$24),\"\",'FY22-23 Work Plan'!$H$24:$H$24)","v":""},{"$f":"IF(ISBLANK('FY22-23 Work Plan'!$D$25:$D$25),\"\",'FY22-23 Work Plan'!$D$25:$D$25)","v":""},{"$f":"IF(ISBLANK('FY22-23 Work Plan'!$H$25:$H$25),\"\",'FY22-23 Work Plan'!$H$25:$H$25)","v":""},{"$f":"IF(ISBLANK('FY22-23 Work Plan'!$D$26:$D$26),\"\",'FY22-23 Work Plan'!$D$26:$D$26)","v":""},{"$f":"IF(ISBLANK('FY22-23 Work Plan'!$H$26:$H$26),\"\",'FY22-23 Work Plan'!$H$26:$H$26)","v":""},{"$f":"IF(ISBLANK('FY22-23 Work Plan'!$D$27:$D$27),\"\",'FY22-23 Work Plan'!$D$27:$D$27)","v":""},{"$f":"IF(ISBLANK('FY22-23 Work Plan'!$H$27:$H$27),\"\",'FY22-23 Work Plan'!$H$27:$H$27)","v":""},{"$f":"IF(ISBLANK('FY22-23 Work Plan'!$D$28:$D$28),\"\",'FY22-23 Work Plan'!$D$28:$D$28)","v":""},{"$f":"IF(ISBLANK('FY22-23 Work Plan'!$H$28:$H$28),\"\",'FY22-23 Work Plan'!$H$28:$H$28)","v":""},{"$f":"IF(ISBLANK('FY22-23 Work Plan'!$D$29:$D$29),\"\",'FY22-23 Work Plan'!$D$29:$D$29)","v":""},{"$f":"IF(ISBLANK('FY22-23 Work Plan'!$H$29:$H$29),\"\",'FY22-23 Work Plan'!$H$29:$H$29)","v":""},{"$f":"IF(ISBLANK('FY22-23 Work Plan'!$B$30:$B$30),\"\",'FY22-23 Work Plan'!$B$30:$B$30)","v":""},{"$f":"IF(ISBLANK('FY22-23 Work Plan'!$D$30:$D$30),\"\",'FY22-23 Work Plan'!$D$30:$D$30)","v":""},{"$f":"IF(ISBLANK('FY22-23 Work Plan'!$H$30:$H$30),\"\",'FY22-23 Work Plan'!$H$30:$H$30)","v":""},{"$f":"IF(ISBLANK('FY22-23 Work Plan'!$B$31:$B$31),\"\",'FY22-23 Work Plan'!$B$31:$B$31)","v":""},{"$f":"IF(ISBLANK('FY22-23 Work Plan'!$D$31:$D$31),\"\",'FY22-23 Work Plan'!$D$31:$D$31)","v":""},{"$f":"IF(ISBLANK('FY22-23 Work Plan'!$H$31:$H$31),\"\",'FY22-23 Work Plan'!$H$31:$H$31)","v":""},{"$f":"IF(ISBLANK('FY22-23 Work Plan'!$B$32:$B$32),\"\",'FY22-23 Work Plan'!$B$32:$B$32)","v":""},{"$f":"IF(ISBLANK('FY22-23 Work Plan'!$D$32:$D$32),\"\",'FY22-23 Work Plan'!$D$32:$D$32)","v":""},{"$f":"IF(ISBLANK('FY22-23 Work Plan'!$H$32:$H$32),\"\",'FY22-23 Work Plan'!$H$32:$H$32)","v":""},{"$f":"IF(ISBLANK('FY22-23 Work Plan'!A51),\"\",'FY22-23 Work Plan'!A51)","v":""},{"$f":"IF(ISBLANK('FY22-23 Work Plan'!D51),\"\",'FY22-23 Work Plan'!D51)","v":""},{"$f":"IF(ISBLANK('FY22-23 Work Plan'!E51),\"\",'FY22-23 Work Plan'!E51)","v":""},{"$f":"IF(ISBLANK('FY22-23 Work Plan'!F51),\"\",'FY22-23 Work Plan'!F51)","v":""},{"$f":"IF(ISBLANK('FY22-23 Work Plan'!H51),\"\",'FY22-23 Work Plan'!H51)","v":""},{"$f":"IF(ISBLANK('FY22-23 Work Plan'!I51),\"\",'FY22-23 Work Plan'!I51)","v":""},{"$f":"IF(ISBLANK('FY22-23 Work Plan'!J51),\"\",'FY22-23 Work Plan'!J51)","v":""},{"$f":"IF(ISBLANK('FY22-23 Work Plan'!K51),\"\",'FY22-23 Work Plan'!K51)","v":""},{"$f":"IF(ISBLANK('FY22-23 Work Plan'!L51),\"\",'FY22-23 Work Plan'!L51)","v":""}]
[{"$f":"IF(ISBLANK('FY22-23 Work Plan'!$E$2:$E$2),\"\",'FY22-23 Work Plan'!$E$2:$E$2)","v":"Asian American Drug Abuse Programs, Inc. (AADAP)"},{"$f":"IF(ISBLANK('FY22-23 Work Plan'!$J$2:$J$2),\"\",'FY22-23 Work Plan'!$J$2:$J$2)","v":"Prevention Education Program (PEP)"},{"$f":"IF(ISBLANK('FY22-23 Work Plan'!$J$3:$J$3),\"\",'FY22-23 Work Plan'!$J$3:$J$3)","v":""},{"$f":"IF(ISBLANK('FY22-23 Work Plan'!$E$3:$E$3),\"\",'FY22-23 Work Plan'!$E$3:$E$3)","v":"PH-004367"},{"$f":"IF(ISBLANK('FY22-23 Work Plan'!$E$4:$E$4),\"\",TEXT('FY22-23 Work Plan'!$E$4:$E$4,\"000000\"))","v":"000001"},{"$f":"IF(ISBLANK('FY22-23 Work Plan'!$J$4:$J$4),\"\",'FY22-23 Work Plan'!$J$4:$J$4)","v":"Building Skills"},{"$f":"IF(ISBLANK('FY22-23 Work Plan'!$E$5:$E$5),\"\",'FY22-23 Work Plan'!$E$5:$E$5)","v":"2 - San Fernando Valley"},{"$f":"IF(ISBLANK('FY22-23 Work Plan'!$J$5:$J$5),\"\",'FY22-23 Work Plan'!$J$5:$J$5)","v":"3rd District, 4th District"},{"$f":"IF(ISBLANK('FY22-23 Work Plan'!$E$6:$E$6),\"\",'FY22-23 Work Plan'!$E$6:$E$6)","v":"Angeles National Forest*, Artesia, Altadena*"},{"$f":"IF(ISBLANK('FY22-23 Work Plan'!$E$7:$E$7),\"\",'FY22-23 Work Plan'!$E$7:$E$7)","v":"Cadillac-Corning, Angeles National Forest"},{"$f":"IF(ISBLANK('FY22-23 Work Plan'!$E$8:$E$8),\"\",'FY22-23 Work Plan'!$E$8:$E$8)","v":"90032, 90036"},{"$f":"IF(ISBLANK('FY22-23 Work Plan'!$E$9:$E$9),\"\",'FY22-23 Work Plan'!$E$9:$E$9)","v":"123 E Main St., Suite 100 \nAnytown, CA 90000"},{"$f":"IF(ISBLANK('FY22-23 Work Plan'!$J$9:$J$9),\"\",TEXT('FY22-23 Work Plan'!$J$9:$J$9,\"###-###-####\"))","v":"999-999-9999"},{"$f":"IF(ISBLANK('FY22-23 Work Plan'!$J$10:$J$10),\"\",'FY22-23 Work Plan'!$J$10:$J$10)","v":"www.abc1.org"},{"$f":"IF(ISBLANK('FY22-23 Work Plan'!$E$11:$E$11),\"\",'FY22-23 Work Plan'!$E$11:$E$11)","v":"123 E Main St., Suite 100 \nAnytown, CA 90000"},{"$f":"IF(ISBLANK('FY22-23 Work Plan'!$J$11:$J$11),\"\",TEXT('FY22-23 Work Plan'!$J$11:$J$11,\"###-###-####\"))","v":"999-999-9999"},{"$f":"IF(ISBLANK('FY22-23 Work Plan'!$J$12:$J$12),\"\",'FY22-23 Work Plan'!$J$12:$J$12)","v":"www.abc2.org"},{"$f":"IF(ISBLANK('FY22-23 Work Plan'!$E$15:$E$15),\"\",'FY22-23 Work Plan'!$E$15:$E$15)","v":"John/Jane Doe"},{"$f":"IF(ISBLANK('FY22-23 Work Plan'!$H$15:$H$15),\"\",TEXT('FY22-23 Work Plan'!$H$15:$H$15,\"###-###-####\"))","v":"213-555-1212"},{"$f":"IF(ISBLANK('FY22-23 Work Plan'!$J$15:$J$15),\"\",'FY22-23 Work Plan'!$J$15:$J$15)","v":"janedoe@preventionusa.com"},{"$f":"IF(ISBLANK('FY22-23 Work Plan'!$E$16:$E$16),\"\",'FY22-23 Work Plan'!$E$16:$E$16)","v":"John/Jane Doe"},{"$f":"IF(ISBLANK('FY22-23 Work Plan'!$H$16:$H$16),\"\",TEXT('FY22-23 Work Plan'!$H$16:$H$16,\"###-###-####\"))","v":"213-555-1212"},{"$f":"IF(ISBLANK('FY22-23 Work Plan'!$J$16:$J$16),\"\",'FY22-23 Work Plan'!$J$16:$J$16)","v":"janedoe@preventionusa.com"},{"$f":"IF(ISBLANK('FY22-23 Work Plan'!$E$17:$E$17),\"\",'FY22-23 Work Plan'!$E$17:$E$17)","v":"John/Jane Doe"},{"$f":"IF(ISBLANK('FY22-23 Work Plan'!$H$17:$H$17),\"\",TEXT('FY22-23 Work Plan'!$H$17:$H$17,\"###-###-####\"))","v":"213-555-1212"},{"$f":"IF(ISBLANK('FY22-23 Work Plan'!$J$17:$J$17),\"\",'FY22-23 Work Plan'!$J$17:$J$17)","v":"j.doe@preventionusa.com"},{"$f":"IF(ISBLANK('FY22-23 Work Plan'!$E$18:$E$18),\"\",'FY22-23 Work Plan'!$E$18:$E$18)","v":"John/Jane Doe"},{"$f":"IF(ISBLANK('FY22-23 Work Plan'!$H$18:$H$18),\"\",TEXT('FY22-23 Work Plan'!$H$18:$H$18,\"###-###-####\"))","v":"213-555-1213"},{"$f":"IF(ISBLANK('FY22-23 Work Plan'!$J$18:$J$18),\"\",'FY22-23 Work Plan'!$J$18:$J$18)","v":"j.doe@preventionusa.com"},{"$f":"IF(ISBLANK('FY22-23 Work Plan'!$E$19:$E$19),\"\",'FY22-23 Work Plan'!$E$19:$E$19)","v":"John/Jane Doe"},{"$f":"IF(ISBLANK('FY22-23 Work Plan'!$H$19:$H$19),\"\",TEXT('FY22-23 Work Plan'!$H$19:$H$19,\"###-###-####\"))","v":"213-555-1213"},{"$f":"IF(ISBLANK('FY22-23 Work Plan'!$J$19:$J$19),\"\",'FY22-23 Work Plan'!$J$19:$J$19)","v":"j.doe@preventionusa.com"},{"$f":"IF(ISBLANK('FY22-23 Work Plan'!$D$23:$D$23),\"\",'FY22-23 Work Plan'!$D$23:$D$23)","v":""},{"$f":"IF(ISBLANK('FY22-23 Work Plan'!$H$23:$H$23),\"\",'FY22-23 Work Plan'!$H$23:$H$23)","v":""},{"$f":"IF(ISBLANK('FY22-23 Work Plan'!$D$24:$D$24),\"\",'FY22-23 Work Plan'!$D$24:$D$24)","v":""},{"$f":"IF(ISBLANK('FY22-23 Work Plan'!$H$24:$H$24),\"\",'FY22-23 Work Plan'!$H$24:$H$24)","v":""},{"$f":"IF(ISBLANK('FY22-23 Work Plan'!$D$25:$D$25),\"\",'FY22-23 Work Plan'!$D$25:$D$25)","v":""},{"$f":"IF(ISBLANK('FY22-23 Work Plan'!$H$25:$H$25),\"\",'FY22-23 Work Plan'!$H$25:$H$25)","v":""},{"$f":"IF(ISBLANK('FY22-23 Work Plan'!$D$26:$D$26),\"\",'FY22-23 Work Plan'!$D$26:$D$26)","v":""},{"$f":"IF(ISBLANK('FY22-23 Work Plan'!$H$26:$H$26),\"\",'FY22-23 Work Plan'!$H$26:$H$26)","v":""},{"$f":"IF(ISBLANK('FY22-23 Work Plan'!$D$27:$D$27),\"\",'FY22-23 Work Plan'!$D$27:$D$27)","v":""},{"$f":"IF(ISBLANK('FY22-23 Work Plan'!$H$27:$H$27),\"\",'FY22-23 Work Plan'!$H$27:$H$27)","v":""},{"$f":"IF(ISBLANK('FY22-23 Work Plan'!$D$28:$D$28),\"\",'FY22-23 Work Plan'!$D$28:$D$28)","v":""},{"$f":"IF(ISBLANK('FY22-23 Work Plan'!$H$28:$H$28),\"\",'FY22-23 Work Plan'!$H$28:$H$28)","v":""},{"$f":"IF(ISBLANK('FY22-23 Work Plan'!$D$29:$D$29),\"\",'FY22-23 Work Plan'!$D$29:$D$29)","v":""},{"$f":"IF(ISBLANK('FY22-23 Work Plan'!$H$29:$H$29),\"\",'FY22-23 Work Plan'!$H$29:$H$29)","v":""},{"$f":"IF(ISBLANK('FY22-23 Work Plan'!$B$30:$B$30),\"\",'FY22-23 Work Plan'!$B$30:$B$30)","v":""},{"$f":"IF(ISBLANK('FY22-23 Work Plan'!$D$30:$D$30),\"\",'FY22-23 Work Plan'!$D$30:$D$30)","v":""},{"$f":"IF(ISBLANK('FY22-23 Work Plan'!$H$30:$H$30),\"\",'FY22-23 Work Plan'!$H$30:$H$30)","v":""},{"$f":"IF(ISBLANK('FY22-23 Work Plan'!$B$31:$B$31),\"\",'FY22-23 Work Plan'!$B$31:$B$31)","v":""},{"$f":"IF(ISBLANK('FY22-23 Work Plan'!$D$31:$D$31),\"\",'FY22-23 Work Plan'!$D$31:$D$31)","v":""},{"$f":"IF(ISBLANK('FY22-23 Work Plan'!$H$31:$H$31),\"\",'FY22-23 Work Plan'!$H$31:$H$31)","v":""},{"$f":"IF(ISBLANK('FY22-23 Work Plan'!$B$32:$B$32),\"\",'FY22-23 Work Plan'!$B$32:$B$32)","v":""},{"$f":"IF(ISBLANK('FY22-23 Work Plan'!$D$32:$D$32),\"\",'FY22-23 Work Plan'!$D$32:$D$32)","v":""},{"$f":"IF(ISBLANK('FY22-23 Work Plan'!$H$32:$H$32),\"\",'FY22-23 Work Plan'!$H$32:$H$32)","v":""},{"$f":"IF(ISBLANK('FY22-23 Work Plan'!A52),\"\",'FY22-23 Work Plan'!A52)","v":""},{"$f":"IF(ISBLANK('FY22-23 Work Plan'!D52),\"\",'FY22-23 Work Plan'!D52)","v":""},{"$f":"IF(ISBLANK('FY22-23 Work Plan'!E52),\"\",'FY22-23 Work Plan'!E52)","v":""},{"$f":"IF(ISBLANK('FY22-23 Work Plan'!F52),\"\",'FY22-23 Work Plan'!F52)","v":""},{"$f":"IF(ISBLANK('FY22-23 Work Plan'!H52),\"\",'FY22-23 Work Plan'!H52)","v":""},{"$f":"IF(ISBLANK('FY22-23 Work Plan'!I52),\"\",'FY22-23 Work Plan'!I52)","v":""},{"$f":"IF(ISBLANK('FY22-23 Work Plan'!J52),\"\",'FY22-23 Work Plan'!J52)","v":""},{"$f":"IF(ISBLANK('FY22-23 Work Plan'!K52),\"\",'FY22-23 Work Plan'!K52)","v":""},{"$f":"IF(ISBLANK('FY22-23 Work Plan'!L52),\"\",'FY22-23 Work Plan'!L52)","v":""}]
[{"$f":"IF(ISBLANK('FY22-23 Work Plan'!$E$2:$E$2),\"\",'FY22-23 Work Plan'!$E$2:$E$2)","v":"Asian American Drug Abuse Programs, Inc. (AADAP)"},{"$f":"IF(ISBLANK('FY22-23 Work Plan'!$J$2:$J$2),\"\",'FY22-23 Work Plan'!$J$2:$J$2)","v":"Prevention Education Program (PEP)"},{"$f":"IF(ISBLANK('FY22-23 Work Plan'!$J$3:$J$3),\"\",'FY22-23 Work Plan'!$J$3:$J$3)","v":""},{"$f":"IF(ISBLANK('FY22-23 Work Plan'!$E$3:$E$3),\"\",'FY22-23 Work Plan'!$E$3:$E$3)","v":"PH-004367"},{"$f":"IF(ISBLANK('FY22-23 Work Plan'!$E$4:$E$4),\"\",TEXT('FY22-23 Work Plan'!$E$4:$E$4,\"000000\"))","v":"000001"},{"$f":"IF(ISBLANK('FY22-23 Work Plan'!$J$4:$J$4),\"\",'FY22-23 Work Plan'!$J$4:$J$4)","v":"Building Skills"},{"$f":"IF(ISBLANK('FY22-23 Work Plan'!$E$5:$E$5),\"\",'FY22-23 Work Plan'!$E$5:$E$5)","v":"2 - San Fernando Valley"},{"$f":"IF(ISBLANK('FY22-23 Work Plan'!$J$5:$J$5),\"\",'FY22-23 Work Plan'!$J$5:$J$5)","v":"3rd District, 4th District"},{"$f":"IF(ISBLANK('FY22-23 Work Plan'!$E$6:$E$6),\"\",'FY22-23 Work Plan'!$E$6:$E$6)","v":"Angeles National Forest*, Artesia, Altadena*"},{"$f":"IF(ISBLANK('FY22-23 Work Plan'!$E$7:$E$7),\"\",'FY22-23 Work Plan'!$E$7:$E$7)","v":"Cadillac-Corning, Angeles National Forest"},{"$f":"IF(ISBLANK('FY22-23 Work Plan'!$E$8:$E$8),\"\",'FY22-23 Work Plan'!$E$8:$E$8)","v":"90032, 90036"},{"$f":"IF(ISBLANK('FY22-23 Work Plan'!$E$9:$E$9),\"\",'FY22-23 Work Plan'!$E$9:$E$9)","v":"123 E Main St., Suite 100 \nAnytown, CA 90000"},{"$f":"IF(ISBLANK('FY22-23 Work Plan'!$J$9:$J$9),\"\",TEXT('FY22-23 Work Plan'!$J$9:$J$9,\"###-###-####\"))","v":"999-999-9999"},{"$f":"IF(ISBLANK('FY22-23 Work Plan'!$J$10:$J$10),\"\",'FY22-23 Work Plan'!$J$10:$J$10)","v":"www.abc1.org"},{"$f":"IF(ISBLANK('FY22-23 Work Plan'!$E$11:$E$11),\"\",'FY22-23 Work Plan'!$E$11:$E$11)","v":"123 E Main St., Suite 100 \nAnytown, CA 90000"},{"$f":"IF(ISBLANK('FY22-23 Work Plan'!$J$11:$J$11),\"\",TEXT('FY22-23 Work Plan'!$J$11:$J$11,\"###-###-####\"))","v":"999-999-9999"},{"$f":"IF(ISBLANK('FY22-23 Work Plan'!$J$12:$J$12),\"\",'FY22-23 Work Plan'!$J$12:$J$12)","v":"www.abc2.org"},{"$f":"IF(ISBLANK('FY22-23 Work Plan'!$E$15:$E$15),\"\",'FY22-23 Work Plan'!$E$15:$E$15)","v":"John/Jane Doe"},{"$f":"IF(ISBLANK('FY22-23 Work Plan'!$H$15:$H$15),\"\",TEXT('FY22-23 Work Plan'!$H$15:$H$15,\"###-###-####\"))","v":"213-555-1212"},{"$f":"IF(ISBLANK('FY22-23 Work Plan'!$J$15:$J$15),\"\",'FY22-23 Work Plan'!$J$15:$J$15)","v":"janedoe@preventionusa.com"},{"$f":"IF(ISBLANK('FY22-23 Work Plan'!$E$16:$E$16),\"\",'FY22-23 Work Plan'!$E$16:$E$16)","v":"John/Jane Doe"},{"$f":"IF(ISBLANK('FY22-23 Work Plan'!$H$16:$H$16),\"\",TEXT('FY22-23 Work Plan'!$H$16:$H$16,\"###-###-####\"))","v":"213-555-1212"},{"$f":"IF(ISBLANK('FY22-23 Work Plan'!$J$16:$J$16),\"\",'FY22-23 Work Plan'!$J$16:$J$16)","v":"janedoe@preventionusa.com"},{"$f":"IF(ISBLANK('FY22-23 Work Plan'!$E$17:$E$17),\"\",'FY22-23 Work Plan'!$E$17:$E$17)","v":"John/Jane Doe"},{"$f":"IF(ISBLANK('FY22-23 Work Plan'!$H$17:$H$17),\"\",TEXT('FY22-23 Work Plan'!$H$17:$H$17,\"###-###-####\"))","v":"213-555-1212"},{"$f":"IF(ISBLANK('FY22-23 Work Plan'!$J$17:$J$17),\"\",'FY22-23 Work Plan'!$J$17:$J$17)","v":"j.doe@preventionusa.com"},{"$f":"IF(ISBLANK('FY22-23 Work Plan'!$E$18:$E$18),\"\",'FY22-23 Work Plan'!$E$18:$E$18)","v":"John/Jane Doe"},{"$f":"IF(ISBLANK('FY22-23 Work Plan'!$H$18:$H$18),\"\",TEXT('FY22-23 Work Plan'!$H$18:$H$18,\"###-###-####\"))","v":"213-555-1213"},{"$f":"IF(ISBLANK('FY22-23 Work Plan'!$J$18:$J$18),\"\",'FY22-23 Work Plan'!$J$18:$J$18)","v":"j.doe@preventionusa.com"},{"$f":"IF(ISBLANK('FY22-23 Work Plan'!$E$19:$E$19),\"\",'FY22-23 Work Plan'!$E$19:$E$19)","v":"John/Jane Doe"},{"$f":"IF(ISBLANK('FY22-23 Work Plan'!$H$19:$H$19),\"\",TEXT('FY22-23 Work Plan'!$H$19:$H$19,\"###-###-####\"))","v":"213-555-1213"},{"$f":"IF(ISBLANK('FY22-23 Work Plan'!$J$19:$J$19),\"\",'FY22-23 Work Plan'!$J$19:$J$19)","v":"j.doe@preventionusa.com"},{"$f":"IF(ISBLANK('FY22-23 Work Plan'!$D$23:$D$23),\"\",'FY22-23 Work Plan'!$D$23:$D$23)","v":""},{"$f":"IF(ISBLANK('FY22-23 Work Plan'!$H$23:$H$23),\"\",'FY22-23 Work Plan'!$H$23:$H$23)","v":""},{"$f":"IF(ISBLANK('FY22-23 Work Plan'!$D$24:$D$24),\"\",'FY22-23 Work Plan'!$D$24:$D$24)","v":""},{"$f":"IF(ISBLANK('FY22-23 Work Plan'!$H$24:$H$24),\"\",'FY22-23 Work Plan'!$H$24:$H$24)","v":""},{"$f":"IF(ISBLANK('FY22-23 Work Plan'!$D$25:$D$25),\"\",'FY22-23 Work Plan'!$D$25:$D$25)","v":""},{"$f":"IF(ISBLANK('FY22-23 Work Plan'!$H$25:$H$25),\"\",'FY22-23 Work Plan'!$H$25:$H$25)","v":""},{"$f":"IF(ISBLANK('FY22-23 Work Plan'!$D$26:$D$26),\"\",'FY22-23 Work Plan'!$D$26:$D$26)","v":""},{"$f":"IF(ISBLANK('FY22-23 Work Plan'!$H$26:$H$26),\"\",'FY22-23 Work Plan'!$H$26:$H$26)","v":""},{"$f":"IF(ISBLANK('FY22-23 Work Plan'!$D$27:$D$27),\"\",'FY22-23 Work Plan'!$D$27:$D$27)","v":""},{"$f":"IF(ISBLANK('FY22-23 Work Plan'!$H$27:$H$27),\"\",'FY22-23 Work Plan'!$H$27:$H$27)","v":""},{"$f":"IF(ISBLANK('FY22-23 Work Plan'!$D$28:$D$28),\"\",'FY22-23 Work Plan'!$D$28:$D$28)","v":""},{"$f":"IF(ISBLANK('FY22-23 Work Plan'!$H$28:$H$28),\"\",'FY22-23 Work Plan'!$H$28:$H$28)","v":""},{"$f":"IF(ISBLANK('FY22-23 Work Plan'!$D$29:$D$29),\"\",'FY22-23 Work Plan'!$D$29:$D$29)","v":""},{"$f":"IF(ISBLANK('FY22-23 Work Plan'!$H$29:$H$29),\"\",'FY22-23 Work Plan'!$H$29:$H$29)","v":""},{"$f":"IF(ISBLANK('FY22-23 Work Plan'!$B$30:$B$30),\"\",'FY22-23 Work Plan'!$B$30:$B$30)","v":""},{"$f":"IF(ISBLANK('FY22-23 Work Plan'!$D$30:$D$30),\"\",'FY22-23 Work Plan'!$D$30:$D$30)","v":""},{"$f":"IF(ISBLANK('FY22-23 Work Plan'!$H$30:$H$30),\"\",'FY22-23 Work Plan'!$H$30:$H$30)","v":""},{"$f":"IF(ISBLANK('FY22-23 Work Plan'!$B$31:$B$31),\"\",'FY22-23 Work Plan'!$B$31:$B$31)","v":""},{"$f":"IF(ISBLANK('FY22-23 Work Plan'!$D$31:$D$31),\"\",'FY22-23 Work Plan'!$D$31:$D$31)","v":""},{"$f":"IF(ISBLANK('FY22-23 Work Plan'!$H$31:$H$31),\"\",'FY22-23 Work Plan'!$H$31:$H$31)","v":""},{"$f":"IF(ISBLANK('FY22-23 Work Plan'!$B$32:$B$32),\"\",'FY22-23 Work Plan'!$B$32:$B$32)","v":""},{"$f":"IF(ISBLANK('FY22-23 Work Plan'!$D$32:$D$32),\"\",'FY22-23 Work Plan'!$D$32:$D$32)","v":""},{"$f":"IF(ISBLANK('FY22-23 Work Plan'!$H$32:$H$32),\"\",'FY22-23 Work Plan'!$H$32:$H$32)","v":""},{"$f":"IF(ISBLANK('FY22-23 Work Plan'!A53),\"\",'FY22-23 Work Plan'!A53)","v":""},{"$f":"IF(ISBLANK('FY22-23 Work Plan'!D53),\"\",'FY22-23 Work Plan'!D53)","v":""},{"$f":"IF(ISBLANK('FY22-23 Work Plan'!E53),\"\",'FY22-23 Work Plan'!E53)","v":""},{"$f":"IF(ISBLANK('FY22-23 Work Plan'!F53),\"\",'FY22-23 Work Plan'!F53)","v":""},{"$f":"IF(ISBLANK('FY22-23 Work Plan'!H53),\"\",'FY22-23 Work Plan'!H53)","v":""},{"$f":"IF(ISBLANK('FY22-23 Work Plan'!I53),\"\",'FY22-23 Work Plan'!I53)","v":""},{"$f":"IF(ISBLANK('FY22-23 Work Plan'!J53),\"\",'FY22-23 Work Plan'!J53)","v":""},{"$f":"IF(ISBLANK('FY22-23 Work Plan'!K53),\"\",'FY22-23 Work Plan'!K53)","v":""},{"$f":"IF(ISBLANK('FY22-23 Work Plan'!L53),\"\",'FY22-23 Work Plan'!L53)","v":""}]
[{"$f":"IF(ISBLANK('FY22-23 Work Plan'!$E$2:$E$2),\"\",'FY22-23 Work Plan'!$E$2:$E$2)","v":"Asian American Drug Abuse Programs, Inc. (AADAP)"},{"$f":"IF(ISBLANK('FY22-23 Work Plan'!$J$2:$J$2),\"\",'FY22-23 Work Plan'!$J$2:$J$2)","v":"Prevention Education Program (PEP)"},{"$f":"IF(ISBLANK('FY22-23 Work Plan'!$J$3:$J$3),\"\",'FY22-23 Work Plan'!$J$3:$J$3)","v":""},{"$f":"IF(ISBLANK('FY22-23 Work Plan'!$E$3:$E$3),\"\",'FY22-23 Work Plan'!$E$3:$E$3)","v":"PH-004367"},{"$f":"IF(ISBLANK('FY22-23 Work Plan'!$E$4:$E$4),\"\",TEXT('FY22-23 Work Plan'!$E$4:$E$4,\"000000\"))","v":"000001"},{"$f":"IF(ISBLANK('FY22-23 Work Plan'!$J$4:$J$4),\"\",'FY22-23 Work Plan'!$J$4:$J$4)","v":"Building Skills"},{"$f":"IF(ISBLANK('FY22-23 Work Plan'!$E$5:$E$5),\"\",'FY22-23 Work Plan'!$E$5:$E$5)","v":"2 - San Fernando Valley"},{"$f":"IF(ISBLANK('FY22-23 Work Plan'!$J$5:$J$5),\"\",'FY22-23 Work Plan'!$J$5:$J$5)","v":"3rd District, 4th District"},{"$f":"IF(ISBLANK('FY22-23 Work Plan'!$E$6:$E$6),\"\",'FY22-23 Work Plan'!$E$6:$E$6)","v":"Angeles National Forest*, Artesia, Altadena*"},{"$f":"IF(ISBLANK('FY22-23 Work Plan'!$E$7:$E$7),\"\",'FY22-23 Work Plan'!$E$7:$E$7)","v":"Cadillac-Corning, Angeles National Forest"},{"$f":"IF(ISBLANK('FY22-23 Work Plan'!$E$8:$E$8),\"\",'FY22-23 Work Plan'!$E$8:$E$8)","v":"90032, 90036"},{"$f":"IF(ISBLANK('FY22-23 Work Plan'!$E$9:$E$9),\"\",'FY22-23 Work Plan'!$E$9:$E$9)","v":"123 E Main St., Suite 100 \nAnytown, CA 90000"},{"$f":"IF(ISBLANK('FY22-23 Work Plan'!$J$9:$J$9),\"\",TEXT('FY22-23 Work Plan'!$J$9:$J$9,\"###-###-####\"))","v":"999-999-9999"},{"$f":"IF(ISBLANK('FY22-23 Work Plan'!$J$10:$J$10),\"\",'FY22-23 Work Plan'!$J$10:$J$10)","v":"www.abc1.org"},{"$f":"IF(ISBLANK('FY22-23 Work Plan'!$E$11:$E$11),\"\",'FY22-23 Work Plan'!$E$11:$E$11)","v":"123 E Main St., Suite 100 \nAnytown, CA 90000"},{"$f":"IF(ISBLANK('FY22-23 Work Plan'!$J$11:$J$11),\"\",TEXT('FY22-23 Work Plan'!$J$11:$J$11,\"###-###-####\"))","v":"999-999-9999"},{"$f":"IF(ISBLANK('FY22-23 Work Plan'!$J$12:$J$12),\"\",'FY22-23 Work Plan'!$J$12:$J$12)","v":"www.abc2.org"},{"$f":"IF(ISBLANK('FY22-23 Work Plan'!$E$15:$E$15),\"\",'FY22-23 Work Plan'!$E$15:$E$15)","v":"John/Jane Doe"},{"$f":"IF(ISBLANK('FY22-23 Work Plan'!$H$15:$H$15),\"\",TEXT('FY22-23 Work Plan'!$H$15:$H$15,\"###-###-####\"))","v":"213-555-1212"},{"$f":"IF(ISBLANK('FY22-23 Work Plan'!$J$15:$J$15),\"\",'FY22-23 Work Plan'!$J$15:$J$15)","v":"janedoe@preventionusa.com"},{"$f":"IF(ISBLANK('FY22-23 Work Plan'!$E$16:$E$16),\"\",'FY22-23 Work Plan'!$E$16:$E$16)","v":"John/Jane Doe"},{"$f":"IF(ISBLANK('FY22-23 Work Plan'!$H$16:$H$16),\"\",TEXT('FY22-23 Work Plan'!$H$16:$H$16,\"###-###-####\"))","v":"213-555-1212"},{"$f":"IF(ISBLANK('FY22-23 Work Plan'!$J$16:$J$16),\"\",'FY22-23 Work Plan'!$J$16:$J$16)","v":"janedoe@preventionusa.com"},{"$f":"IF(ISBLANK('FY22-23 Work Plan'!$E$17:$E$17),\"\",'FY22-23 Work Plan'!$E$17:$E$17)","v":"John/Jane Doe"},{"$f":"IF(ISBLANK('FY22-23 Work Plan'!$H$17:$H$17),\"\",TEXT('FY22-23 Work Plan'!$H$17:$H$17,\"###-###-####\"))","v":"213-555-1212"},{"$f":"IF(ISBLANK('FY22-23 Work Plan'!$J$17:$J$17),\"\",'FY22-23 Work Plan'!$J$17:$J$17)","v":"j.doe@preventionusa.com"},{"$f":"IF(ISBLANK('FY22-23 Work Plan'!$E$18:$E$18),\"\",'FY22-23 Work Plan'!$E$18:$E$18)","v":"John/Jane Doe"},{"$f":"IF(ISBLANK('FY22-23 Work Plan'!$H$18:$H$18),\"\",TEXT('FY22-23 Work Plan'!$H$18:$H$18,\"###-###-####\"))","v":"213-555-1213"},{"$f":"IF(ISBLANK('FY22-23 Work Plan'!$J$18:$J$18),\"\",'FY22-23 Work Plan'!$J$18:$J$18)","v":"j.doe@preventionusa.com"},{"$f":"IF(ISBLANK('FY22-23 Work Plan'!$E$19:$E$19),\"\",'FY22-23 Work Plan'!$E$19:$E$19)","v":"John/Jane Doe"},{"$f":"IF(ISBLANK('FY22-23 Work Plan'!$H$19:$H$19),\"\",TEXT('FY22-23 Work Plan'!$H$19:$H$19,\"###-###-####\"))","v":"213-555-1213"},{"$f":"IF(ISBLANK('FY22-23 Work Plan'!$J$19:$J$19),\"\",'FY22-23 Work Plan'!$J$19:$J$19)","v":"j.doe@preventionusa.com"},{"$f":"IF(ISBLANK('FY22-23 Work Plan'!$D$23:$D$23),\"\",'FY22-23 Work Plan'!$D$23:$D$23)","v":""},{"$f":"IF(ISBLANK('FY22-23 Work Plan'!$H$23:$H$23),\"\",'FY22-23 Work Plan'!$H$23:$H$23)","v":""},{"$f":"IF(ISBLANK('FY22-23 Work Plan'!$D$24:$D$24),\"\",'FY22-23 Work Plan'!$D$24:$D$24)","v":""},{"$f":"IF(ISBLANK('FY22-23 Work Plan'!$H$24:$H$24),\"\",'FY22-23 Work Plan'!$H$24:$H$24)","v":""},{"$f":"IF(ISBLANK('FY22-23 Work Plan'!$D$25:$D$25),\"\",'FY22-23 Work Plan'!$D$25:$D$25)","v":""},{"$f":"IF(ISBLANK('FY22-23 Work Plan'!$H$25:$H$25),\"\",'FY22-23 Work Plan'!$H$25:$H$25)","v":""},{"$f":"IF(ISBLANK('FY22-23 Work Plan'!$D$26:$D$26),\"\",'FY22-23 Work Plan'!$D$26:$D$26)","v":""},{"$f":"IF(ISBLANK('FY22-23 Work Plan'!$H$26:$H$26),\"\",'FY22-23 Work Plan'!$H$26:$H$26)","v":""},{"$f":"IF(ISBLANK('FY22-23 Work Plan'!$D$27:$D$27),\"\",'FY22-23 Work Plan'!$D$27:$D$27)","v":""},{"$f":"IF(ISBLANK('FY22-23 Work Plan'!$H$27:$H$27),\"\",'FY22-23 Work Plan'!$H$27:$H$27)","v":""},{"$f":"IF(ISBLANK('FY22-23 Work Plan'!$D$28:$D$28),\"\",'FY22-23 Work Plan'!$D$28:$D$28)","v":""},{"$f":"IF(ISBLANK('FY22-23 Work Plan'!$H$28:$H$28),\"\",'FY22-23 Work Plan'!$H$28:$H$28)","v":""},{"$f":"IF(ISBLANK('FY22-23 Work Plan'!$D$29:$D$29),\"\",'FY22-23 Work Plan'!$D$29:$D$29)","v":""},{"$f":"IF(ISBLANK('FY22-23 Work Plan'!$H$29:$H$29),\"\",'FY22-23 Work Plan'!$H$29:$H$29)","v":""},{"$f":"IF(ISBLANK('FY22-23 Work Plan'!$B$30:$B$30),\"\",'FY22-23 Work Plan'!$B$30:$B$30)","v":""},{"$f":"IF(ISBLANK('FY22-23 Work Plan'!$D$30:$D$30),\"\",'FY22-23 Work Plan'!$D$30:$D$30)","v":""},{"$f":"IF(ISBLANK('FY22-23 Work Plan'!$H$30:$H$30),\"\",'FY22-23 Work Plan'!$H$30:$H$30)","v":""},{"$f":"IF(ISBLANK('FY22-23 Work Plan'!$B$31:$B$31),\"\",'FY22-23 Work Plan'!$B$31:$B$31)","v":""},{"$f":"IF(ISBLANK('FY22-23 Work Plan'!$D$31:$D$31),\"\",'FY22-23 Work Plan'!$D$31:$D$31)","v":""},{"$f":"IF(ISBLANK('FY22-23 Work Plan'!$H$31:$H$31),\"\",'FY22-23 Work Plan'!$H$31:$H$31)","v":""},{"$f":"IF(ISBLANK('FY22-23 Work Plan'!$B$32:$B$32),\"\",'FY22-23 Work Plan'!$B$32:$B$32)","v":""},{"$f":"IF(ISBLANK('FY22-23 Work Plan'!$D$32:$D$32),\"\",'FY22-23 Work Plan'!$D$32:$D$32)","v":""},{"$f":"IF(ISBLANK('FY22-23 Work Plan'!$H$32:$H$32),\"\",'FY22-23 Work Plan'!$H$32:$H$32)","v":""},{"$f":"IF(ISBLANK('FY22-23 Work Plan'!A54),\"\",'FY22-23 Work Plan'!A54)","v":""},{"$f":"IF(ISBLANK('FY22-23 Work Plan'!D54),\"\",'FY22-23 Work Plan'!D54)","v":""},{"$f":"IF(ISBLANK('FY22-23 Work Plan'!E54),\"\",'FY22-23 Work Plan'!E54)","v":""},{"$f":"IF(ISBLANK('FY22-23 Work Plan'!F54),\"\",'FY22-23 Work Plan'!F54)","v":""},{"$f":"IF(ISBLANK('FY22-23 Work Plan'!H54),\"\",'FY22-23 Work Plan'!H54)","v":""},{"$f":"IF(ISBLANK('FY22-23 Work Plan'!I54),\"\",'FY22-23 Work Plan'!I54)","v":""},{"$f":"IF(ISBLANK('FY22-23 Work Plan'!J54),\"\",'FY22-23 Work Plan'!J54)","v":""},{"$f":"IF(ISBLANK('FY22-23 Work Plan'!K54),\"\",'FY22-23 Work Plan'!K54)","v":""},{"$f":"IF(ISBLANK('FY22-23 Work Plan'!L54),\"\",'FY22-23 Work Plan'!L54)","v":""}]
[{"$f":"IF(ISBLANK('FY22-23 Work Plan'!$E$2:$E$2),\"\",'FY22-23 Work Plan'!$E$2:$E$2)","v":"Asian American Drug Abuse Programs, Inc. (AADAP)"},{"$f":"IF(ISBLANK('FY22-23 Work Plan'!$J$2:$J$2),\"\",'FY22-23 Work Plan'!$J$2:$J$2)","v":"Prevention Education Program (PEP)"},{"$f":"IF(ISBLANK('FY22-23 Work Plan'!$J$3:$J$3),\"\",'FY22-23 Work Plan'!$J$3:$J$3)","v":""},{"$f":"IF(ISBLANK('FY22-23 Work Plan'!$E$3:$E$3),\"\",'FY22-23 Work Plan'!$E$3:$E$3)","v":"PH-004367"},{"$f":"IF(ISBLANK('FY22-23 Work Plan'!$E$4:$E$4),\"\",TEXT('FY22-23 Work Plan'!$E$4:$E$4,\"000000\"))","v":"000001"},{"$f":"IF(ISBLANK('FY22-23 Work Plan'!$J$4:$J$4),\"\",'FY22-23 Work Plan'!$J$4:$J$4)","v":"Building Skills"},{"$f":"IF(ISBLANK('FY22-23 Work Plan'!$E$5:$E$5),\"\",'FY22-23 Work Plan'!$E$5:$E$5)","v":"2 - San Fernando Valley"},{"$f":"IF(ISBLANK('FY22-23 Work Plan'!$J$5:$J$5),\"\",'FY22-23 Work Plan'!$J$5:$J$5)","v":"3rd District, 4th District"},{"$f":"IF(ISBLANK('FY22-23 Work Plan'!$E$6:$E$6),\"\",'FY22-23 Work Plan'!$E$6:$E$6)","v":"Angeles National Forest*, Artesia, Altadena*"},{"$f":"IF(ISBLANK('FY22-23 Work Plan'!$E$7:$E$7),\"\",'FY22-23 Work Plan'!$E$7:$E$7)","v":"Cadillac-Corning, Angeles National Forest"},{"$f":"IF(ISBLANK('FY22-23 Work Plan'!$E$8:$E$8),\"\",'FY22-23 Work Plan'!$E$8:$E$8)","v":"90032, 90036"},{"$f":"IF(ISBLANK('FY22-23 Work Plan'!$E$9:$E$9),\"\",'FY22-23 Work Plan'!$E$9:$E$9)","v":"123 E Main St., Suite 100 \nAnytown, CA 90000"},{"$f":"IF(ISBLANK('FY22-23 Work Plan'!$J$9:$J$9),\"\",TEXT('FY22-23 Work Plan'!$J$9:$J$9,\"###-###-####\"))","v":"999-999-9999"},{"$f":"IF(ISBLANK('FY22-23 Work Plan'!$J$10:$J$10),\"\",'FY22-23 Work Plan'!$J$10:$J$10)","v":"www.abc1.org"},{"$f":"IF(ISBLANK('FY22-23 Work Plan'!$E$11:$E$11),\"\",'FY22-23 Work Plan'!$E$11:$E$11)","v":"123 E Main St., Suite 100 \nAnytown, CA 90000"},{"$f":"IF(ISBLANK('FY22-23 Work Plan'!$J$11:$J$11),\"\",TEXT('FY22-23 Work Plan'!$J$11:$J$11,\"###-###-####\"))","v":"999-999-9999"},{"$f":"IF(ISBLANK('FY22-23 Work Plan'!$J$12:$J$12),\"\",'FY22-23 Work Plan'!$J$12:$J$12)","v":"www.abc2.org"},{"$f":"IF(ISBLANK('FY22-23 Work Plan'!$E$15:$E$15),\"\",'FY22-23 Work Plan'!$E$15:$E$15)","v":"John/Jane Doe"},{"$f":"IF(ISBLANK('FY22-23 Work Plan'!$H$15:$H$15),\"\",TEXT('FY22-23 Work Plan'!$H$15:$H$15,\"###-###-####\"))","v":"213-555-1212"},{"$f":"IF(ISBLANK('FY22-23 Work Plan'!$J$15:$J$15),\"\",'FY22-23 Work Plan'!$J$15:$J$15)","v":"janedoe@preventionusa.com"},{"$f":"IF(ISBLANK('FY22-23 Work Plan'!$E$16:$E$16),\"\",'FY22-23 Work Plan'!$E$16:$E$16)","v":"John/Jane Doe"},{"$f":"IF(ISBLANK('FY22-23 Work Plan'!$H$16:$H$16),\"\",TEXT('FY22-23 Work Plan'!$H$16:$H$16,\"###-###-####\"))","v":"213-555-1212"},{"$f":"IF(ISBLANK('FY22-23 Work Plan'!$J$16:$J$16),\"\",'FY22-23 Work Plan'!$J$16:$J$16)","v":"janedoe@preventionusa.com"},{"$f":"IF(ISBLANK('FY22-23 Work Plan'!$E$17:$E$17),\"\",'FY22-23 Work Plan'!$E$17:$E$17)","v":"John/Jane Doe"},{"$f":"IF(ISBLANK('FY22-23 Work Plan'!$H$17:$H$17),\"\",TEXT('FY22-23 Work Plan'!$H$17:$H$17,\"###-###-####\"))","v":"213-555-1212"},{"$f":"IF(ISBLANK('FY22-23 Work Plan'!$J$17:$J$17),\"\",'FY22-23 Work Plan'!$J$17:$J$17)","v":"j.doe@preventionusa.com"},{"$f":"IF(ISBLANK('FY22-23 Work Plan'!$E$18:$E$18),\"\",'FY22-23 Work Plan'!$E$18:$E$18)","v":"John/Jane Doe"},{"$f":"IF(ISBLANK('FY22-23 Work Plan'!$H$18:$H$18),\"\",TEXT('FY22-23 Work Plan'!$H$18:$H$18,\"###-###-####\"))","v":"213-555-1213"},{"$f":"IF(ISBLANK('FY22-23 Work Plan'!$J$18:$J$18),\"\",'FY22-23 Work Plan'!$J$18:$J$18)","v":"j.doe@preventionusa.com"},{"$f":"IF(ISBLANK('FY22-23 Work Plan'!$E$19:$E$19),\"\",'FY22-23 Work Plan'!$E$19:$E$19)","v":"John/Jane Doe"},{"$f":"IF(ISBLANK('FY22-23 Work Plan'!$H$19:$H$19),\"\",TEXT('FY22-23 Work Plan'!$H$19:$H$19,\"###-###-####\"))","v":"213-555-1213"},{"$f":"IF(ISBLANK('FY22-23 Work Plan'!$J$19:$J$19),\"\",'FY22-23 Work Plan'!$J$19:$J$19)","v":"j.doe@preventionusa.com"},{"$f":"IF(ISBLANK('FY22-23 Work Plan'!$D$23:$D$23),\"\",'FY22-23 Work Plan'!$D$23:$D$23)","v":""},{"$f":"IF(ISBLANK('FY22-23 Work Plan'!$H$23:$H$23),\"\",'FY22-23 Work Plan'!$H$23:$H$23)","v":""},{"$f":"IF(ISBLANK('FY22-23 Work Plan'!$D$24:$D$24),\"\",'FY22-23 Work Plan'!$D$24:$D$24)","v":""},{"$f":"IF(ISBLANK('FY22-23 Work Plan'!$H$24:$H$24),\"\",'FY22-23 Work Plan'!$H$24:$H$24)","v":""},{"$f":"IF(ISBLANK('FY22-23 Work Plan'!$D$25:$D$25),\"\",'FY22-23 Work Plan'!$D$25:$D$25)","v":""},{"$f":"IF(ISBLANK('FY22-23 Work Plan'!$H$25:$H$25),\"\",'FY22-23 Work Plan'!$H$25:$H$25)","v":""},{"$f":"IF(ISBLANK('FY22-23 Work Plan'!$D$26:$D$26),\"\",'FY22-23 Work Plan'!$D$26:$D$26)","v":""},{"$f":"IF(ISBLANK('FY22-23 Work Plan'!$H$26:$H$26),\"\",'FY22-23 Work Plan'!$H$26:$H$26)","v":""},{"$f":"IF(ISBLANK('FY22-23 Work Plan'!$D$27:$D$27),\"\",'FY22-23 Work Plan'!$D$27:$D$27)","v":""},{"$f":"IF(ISBLANK('FY22-23 Work Plan'!$H$27:$H$27),\"\",'FY22-23 Work Plan'!$H$27:$H$27)","v":""},{"$f":"IF(ISBLANK('FY22-23 Work Plan'!$D$28:$D$28),\"\",'FY22-23 Work Plan'!$D$28:$D$28)","v":""},{"$f":"IF(ISBLANK('FY22-23 Work Plan'!$H$28:$H$28),\"\",'FY22-23 Work Plan'!$H$28:$H$28)","v":""},{"$f":"IF(ISBLANK('FY22-23 Work Plan'!$D$29:$D$29),\"\",'FY22-23 Work Plan'!$D$29:$D$29)","v":""},{"$f":"IF(ISBLANK('FY22-23 Work Plan'!$H$29:$H$29),\"\",'FY22-23 Work Plan'!$H$29:$H$29)","v":""},{"$f":"IF(ISBLANK('FY22-23 Work Plan'!$B$30:$B$30),\"\",'FY22-23 Work Plan'!$B$30:$B$30)","v":""},{"$f":"IF(ISBLANK('FY22-23 Work Plan'!$D$30:$D$30),\"\",'FY22-23 Work Plan'!$D$30:$D$30)","v":""},{"$f":"IF(ISBLANK('FY22-23 Work Plan'!$H$30:$H$30),\"\",'FY22-23 Work Plan'!$H$30:$H$30)","v":""},{"$f":"IF(ISBLANK('FY22-23 Work Plan'!$B$31:$B$31),\"\",'FY22-23 Work Plan'!$B$31:$B$31)","v":""},{"$f":"IF(ISBLANK('FY22-23 Work Plan'!$D$31:$D$31),\"\",'FY22-23 Work Plan'!$D$31:$D$31)","v":""},{"$f":"IF(ISBLANK('FY22-23 Work Plan'!$H$31:$H$31),\"\",'FY22-23 Work Plan'!$H$31:$H$31)","v":""},{"$f":"IF(ISBLANK('FY22-23 Work Plan'!$B$32:$B$32),\"\",'FY22-23 Work Plan'!$B$32:$B$32)","v":""},{"$f":"IF(ISBLANK('FY22-23 Work Plan'!$D$32:$D$32),\"\",'FY22-23 Work Plan'!$D$32:$D$32)","v":""},{"$f":"IF(ISBLANK('FY22-23 Work Plan'!$H$32:$H$32),\"\",'FY22-23 Work Plan'!$H$32:$H$32)","v":""},{"$f":"IF(ISBLANK('FY22-23 Work Plan'!A55),\"\",'FY22-23 Work Plan'!A55)","v":""},{"$f":"IF(ISBLANK('FY22-23 Work Plan'!D55),\"\",'FY22-23 Work Plan'!D55)","v":""},{"$f":"IF(ISBLANK('FY22-23 Work Plan'!E55),\"\",'FY22-23 Work Plan'!E55)","v":""},{"$f":"IF(ISBLANK('FY22-23 Work Plan'!F55),\"\",'FY22-23 Work Plan'!F55)","v":""},{"$f":"IF(ISBLANK('FY22-23 Work Plan'!H55),\"\",'FY22-23 Work Plan'!H55)","v":""},{"$f":"IF(ISBLANK('FY22-23 Work Plan'!I55),\"\",'FY22-23 Work Plan'!I55)","v":""},{"$f":"IF(ISBLANK('FY22-23 Work Plan'!J55),\"\",'FY22-23 Work Plan'!J55)","v":""},{"$f":"IF(ISBLANK('FY22-23 Work Plan'!K55),\"\",'FY22-23 Work Plan'!K55)","v":""},{"$f":"IF(ISBLANK('FY22-23 Work Plan'!L55),\"\",'FY22-23 Work Plan'!L55)","v":""}]
[{"$f":"IF(ISBLANK('FY22-23 Work Plan'!$E$2:$E$2),\"\",'FY22-23 Work Plan'!$E$2:$E$2)","v":"Asian American Drug Abuse Programs, Inc. (AADAP)"},{"$f":"IF(ISBLANK('FY22-23 Work Plan'!$J$2:$J$2),\"\",'FY22-23 Work Plan'!$J$2:$J$2)","v":"Prevention Education Program (PEP)"},{"$f":"IF(ISBLANK('FY22-23 Work Plan'!$J$3:$J$3),\"\",'FY22-23 Work Plan'!$J$3:$J$3)","v":""},{"$f":"IF(ISBLANK('FY22-23 Work Plan'!$E$3:$E$3),\"\",'FY22-23 Work Plan'!$E$3:$E$3)","v":"PH-004367"},{"$f":"IF(ISBLANK('FY22-23 Work Plan'!$E$4:$E$4),\"\",TEXT('FY22-23 Work Plan'!$E$4:$E$4,\"000000\"))","v":"000001"},{"$f":"IF(ISBLANK('FY22-23 Work Plan'!$J$4:$J$4),\"\",'FY22-23 Work Plan'!$J$4:$J$4)","v":"Building Skills"},{"$f":"IF(ISBLANK('FY22-23 Work Plan'!$E$5:$E$5),\"\",'FY22-23 Work Plan'!$E$5:$E$5)","v":"2 - San Fernando Valley"},{"$f":"IF(ISBLANK('FY22-23 Work Plan'!$J$5:$J$5),\"\",'FY22-23 Work Plan'!$J$5:$J$5)","v":"3rd District, 4th District"},{"$f":"IF(ISBLANK('FY22-23 Work Plan'!$E$6:$E$6),\"\",'FY22-23 Work Plan'!$E$6:$E$6)","v":"Angeles National Forest*, Artesia, Altadena*"},{"$f":"IF(ISBLANK('FY22-23 Work Plan'!$E$7:$E$7),\"\",'FY22-23 Work Plan'!$E$7:$E$7)","v":"Cadillac-Corning, Angeles National Forest"},{"$f":"IF(ISBLANK('FY22-23 Work Plan'!$E$8:$E$8),\"\",'FY22-23 Work Plan'!$E$8:$E$8)","v":"90032, 90036"},{"$f":"IF(ISBLANK('FY22-23 Work Plan'!$E$9:$E$9),\"\",'FY22-23 Work Plan'!$E$9:$E$9)","v":"123 E Main St., Suite 100 \nAnytown, CA 90000"},{"$f":"IF(ISBLANK('FY22-23 Work Plan'!$J$9:$J$9),\"\",TEXT('FY22-23 Work Plan'!$J$9:$J$9,\"###-###-####\"))","v":"999-999-9999"},{"$f":"IF(ISBLANK('FY22-23 Work Plan'!$J$10:$J$10),\"\",'FY22-23 Work Plan'!$J$10:$J$10)","v":"www.abc1.org"},{"$f":"IF(ISBLANK('FY22-23 Work Plan'!$E$11:$E$11),\"\",'FY22-23 Work Plan'!$E$11:$E$11)","v":"123 E Main St., Suite 100 \nAnytown, CA 90000"},{"$f":"IF(ISBLANK('FY22-23 Work Plan'!$J$11:$J$11),\"\",TEXT('FY22-23 Work Plan'!$J$11:$J$11,\"###-###-####\"))","v":"999-999-9999"},{"$f":"IF(ISBLANK('FY22-23 Work Plan'!$J$12:$J$12),\"\",'FY22-23 Work Plan'!$J$12:$J$12)","v":"www.abc2.org"},{"$f":"IF(ISBLANK('FY22-23 Work Plan'!$E$15:$E$15),\"\",'FY22-23 Work Plan'!$E$15:$E$15)","v":"John/Jane Doe"},{"$f":"IF(ISBLANK('FY22-23 Work Plan'!$H$15:$H$15),\"\",TEXT('FY22-23 Work Plan'!$H$15:$H$15,\"###-###-####\"))","v":"213-555-1212"},{"$f":"IF(ISBLANK('FY22-23 Work Plan'!$J$15:$J$15),\"\",'FY22-23 Work Plan'!$J$15:$J$15)","v":"janedoe@preventionusa.com"},{"$f":"IF(ISBLANK('FY22-23 Work Plan'!$E$16:$E$16),\"\",'FY22-23 Work Plan'!$E$16:$E$16)","v":"John/Jane Doe"},{"$f":"IF(ISBLANK('FY22-23 Work Plan'!$H$16:$H$16),\"\",TEXT('FY22-23 Work Plan'!$H$16:$H$16,\"###-###-####\"))","v":"213-555-1212"},{"$f":"IF(ISBLANK('FY22-23 Work Plan'!$J$16:$J$16),\"\",'FY22-23 Work Plan'!$J$16:$J$16)","v":"janedoe@preventionusa.com"},{"$f":"IF(ISBLANK('FY22-23 Work Plan'!$E$17:$E$17),\"\",'FY22-23 Work Plan'!$E$17:$E$17)","v":"John/Jane Doe"},{"$f":"IF(ISBLANK('FY22-23 Work Plan'!$H$17:$H$17),\"\",TEXT('FY22-23 Work Plan'!$H$17:$H$17,\"###-###-####\"))","v":"213-555-1212"},{"$f":"IF(ISBLANK('FY22-23 Work Plan'!$J$17:$J$17),\"\",'FY22-23 Work Plan'!$J$17:$J$17)","v":"j.doe@preventionusa.com"},{"$f":"IF(ISBLANK('FY22-23 Work Plan'!$E$18:$E$18),\"\",'FY22-23 Work Plan'!$E$18:$E$18)","v":"John/Jane Doe"},{"$f":"IF(ISBLANK('FY22-23 Work Plan'!$H$18:$H$18),\"\",TEXT('FY22-23 Work Plan'!$H$18:$H$18,\"###-###-####\"))","v":"213-555-1213"},{"$f":"IF(ISBLANK('FY22-23 Work Plan'!$J$18:$J$18),\"\",'FY22-23 Work Plan'!$J$18:$J$18)","v":"j.doe@preventionusa.com"},{"$f":"IF(ISBLANK('FY22-23 Work Plan'!$E$19:$E$19),\"\",'FY22-23 Work Plan'!$E$19:$E$19)","v":"John/Jane Doe"},{"$f":"IF(ISBLANK('FY22-23 Work Plan'!$H$19:$H$19),\"\",TEXT('FY22-23 Work Plan'!$H$19:$H$19,\"###-###-####\"))","v":"213-555-1213"},{"$f":"IF(ISBLANK('FY22-23 Work Plan'!$J$19:$J$19),\"\",'FY22-23 Work Plan'!$J$19:$J$19)","v":"j.doe@preventionusa.com"},{"$f":"IF(ISBLANK('FY22-23 Work Plan'!$D$23:$D$23),\"\",'FY22-23 Work Plan'!$D$23:$D$23)","v":""},{"$f":"IF(ISBLANK('FY22-23 Work Plan'!$H$23:$H$23),\"\",'FY22-23 Work Plan'!$H$23:$H$23)","v":""},{"$f":"IF(ISBLANK('FY22-23 Work Plan'!$D$24:$D$24),\"\",'FY22-23 Work Plan'!$D$24:$D$24)","v":""},{"$f":"IF(ISBLANK('FY22-23 Work Plan'!$H$24:$H$24),\"\",'FY22-23 Work Plan'!$H$24:$H$24)","v":""},{"$f":"IF(ISBLANK('FY22-23 Work Plan'!$D$25:$D$25),\"\",'FY22-23 Work Plan'!$D$25:$D$25)","v":""},{"$f":"IF(ISBLANK('FY22-23 Work Plan'!$H$25:$H$25),\"\",'FY22-23 Work Plan'!$H$25:$H$25)","v":""},{"$f":"IF(ISBLANK('FY22-23 Work Plan'!$D$26:$D$26),\"\",'FY22-23 Work Plan'!$D$26:$D$26)","v":""},{"$f":"IF(ISBLANK('FY22-23 Work Plan'!$H$26:$H$26),\"\",'FY22-23 Work Plan'!$H$26:$H$26)","v":""},{"$f":"IF(ISBLANK('FY22-23 Work Plan'!$D$27:$D$27),\"\",'FY22-23 Work Plan'!$D$27:$D$27)","v":""},{"$f":"IF(ISBLANK('FY22-23 Work Plan'!$H$27:$H$27),\"\",'FY22-23 Work Plan'!$H$27:$H$27)","v":""},{"$f":"IF(ISBLANK('FY22-23 Work Plan'!$D$28:$D$28),\"\",'FY22-23 Work Plan'!$D$28:$D$28)","v":""},{"$f":"IF(ISBLANK('FY22-23 Work Plan'!$H$28:$H$28),\"\",'FY22-23 Work Plan'!$H$28:$H$28)","v":""},{"$f":"IF(ISBLANK('FY22-23 Work Plan'!$D$29:$D$29),\"\",'FY22-23 Work Plan'!$D$29:$D$29)","v":""},{"$f":"IF(ISBLANK('FY22-23 Work Plan'!$H$29:$H$29),\"\",'FY22-23 Work Plan'!$H$29:$H$29)","v":""},{"$f":"IF(ISBLANK('FY22-23 Work Plan'!$B$30:$B$30),\"\",'FY22-23 Work Plan'!$B$30:$B$30)","v":""},{"$f":"IF(ISBLANK('FY22-23 Work Plan'!$D$30:$D$30),\"\",'FY22-23 Work Plan'!$D$30:$D$30)","v":""},{"$f":"IF(ISBLANK('FY22-23 Work Plan'!$H$30:$H$30),\"\",'FY22-23 Work Plan'!$H$30:$H$30)","v":""},{"$f":"IF(ISBLANK('FY22-23 Work Plan'!$B$31:$B$31),\"\",'FY22-23 Work Plan'!$B$31:$B$31)","v":""},{"$f":"IF(ISBLANK('FY22-23 Work Plan'!$D$31:$D$31),\"\",'FY22-23 Work Plan'!$D$31:$D$31)","v":""},{"$f":"IF(ISBLANK('FY22-23 Work Plan'!$H$31:$H$31),\"\",'FY22-23 Work Plan'!$H$31:$H$31)","v":""},{"$f":"IF(ISBLANK('FY22-23 Work Plan'!$B$32:$B$32),\"\",'FY22-23 Work Plan'!$B$32:$B$32)","v":""},{"$f":"IF(ISBLANK('FY22-23 Work Plan'!$D$32:$D$32),\"\",'FY22-23 Work Plan'!$D$32:$D$32)","v":""},{"$f":"IF(ISBLANK('FY22-23 Work Plan'!$H$32:$H$32),\"\",'FY22-23 Work Plan'!$H$32:$H$32)","v":""},{"$f":"IF(ISBLANK('FY22-23 Work Plan'!A56),\"\",'FY22-23 Work Plan'!A56)","v":""},{"$f":"IF(ISBLANK('FY22-23 Work Plan'!D56),\"\",'FY22-23 Work Plan'!D56)","v":""},{"$f":"IF(ISBLANK('FY22-23 Work Plan'!E56),\"\",'FY22-23 Work Plan'!E56)","v":""},{"$f":"IF(ISBLANK('FY22-23 Work Plan'!F56),\"\",'FY22-23 Work Plan'!F56)","v":""},{"$f":"IF(ISBLANK('FY22-23 Work Plan'!H56),\"\",'FY22-23 Work Plan'!H56)","v":""},{"$f":"IF(ISBLANK('FY22-23 Work Plan'!I56),\"\",'FY22-23 Work Plan'!I56)","v":""},{"$f":"IF(ISBLANK('FY22-23 Work Plan'!J56),\"\",'FY22-23 Work Plan'!J56)","v":""},{"$f":"IF(ISBLANK('FY22-23 Work Plan'!K56),\"\",'FY22-23 Work Plan'!K56)","v":""},{"$f":"IF(ISBLANK('FY22-23 Work Plan'!L56),\"\",'FY22-23 Work Plan'!L56)","v":""}]
[{"$f":"IF(ISBLANK('FY22-23 Work Plan'!$E$2:$E$2),\"\",'FY22-23 Work Plan'!$E$2:$E$2)","v":"Asian American Drug Abuse Programs, Inc. (AADAP)"},{"$f":"IF(ISBLANK('FY22-23 Work Plan'!$J$2:$J$2),\"\",'FY22-23 Work Plan'!$J$2:$J$2)","v":"Prevention Education Program (PEP)"},{"$f":"IF(ISBLANK('FY22-23 Work Plan'!$J$3:$J$3),\"\",'FY22-23 Work Plan'!$J$3:$J$3)","v":""},{"$f":"IF(ISBLANK('FY22-23 Work Plan'!$E$3:$E$3),\"\",'FY22-23 Work Plan'!$E$3:$E$3)","v":"PH-004367"},{"$f":"IF(ISBLANK('FY22-23 Work Plan'!$E$4:$E$4),\"\",TEXT('FY22-23 Work Plan'!$E$4:$E$4,\"000000\"))","v":"000001"},{"$f":"IF(ISBLANK('FY22-23 Work Plan'!$J$4:$J$4),\"\",'FY22-23 Work Plan'!$J$4:$J$4)","v":"Building Skills"},{"$f":"IF(ISBLANK('FY22-23 Work Plan'!$E$5:$E$5),\"\",'FY22-23 Work Plan'!$E$5:$E$5)","v":"2 - San Fernando Valley"},{"$f":"IF(ISBLANK('FY22-23 Work Plan'!$J$5:$J$5),\"\",'FY22-23 Work Plan'!$J$5:$J$5)","v":"3rd District, 4th District"},{"$f":"IF(ISBLANK('FY22-23 Work Plan'!$E$6:$E$6),\"\",'FY22-23 Work Plan'!$E$6:$E$6)","v":"Angeles National Forest*, Artesia, Altadena*"},{"$f":"IF(ISBLANK('FY22-23 Work Plan'!$E$7:$E$7),\"\",'FY22-23 Work Plan'!$E$7:$E$7)","v":"Cadillac-Corning, Angeles National Forest"},{"$f":"IF(ISBLANK('FY22-23 Work Plan'!$E$8:$E$8),\"\",'FY22-23 Work Plan'!$E$8:$E$8)","v":"90032, 90036"},{"$f":"IF(ISBLANK('FY22-23 Work Plan'!$E$9:$E$9),\"\",'FY22-23 Work Plan'!$E$9:$E$9)","v":"123 E Main St., Suite 100 \nAnytown, CA 90000"},{"$f":"IF(ISBLANK('FY22-23 Work Plan'!$J$9:$J$9),\"\",TEXT('FY22-23 Work Plan'!$J$9:$J$9,\"###-###-####\"))","v":"999-999-9999"},{"$f":"IF(ISBLANK('FY22-23 Work Plan'!$J$10:$J$10),\"\",'FY22-23 Work Plan'!$J$10:$J$10)","v":"www.abc1.org"},{"$f":"IF(ISBLANK('FY22-23 Work Plan'!$E$11:$E$11),\"\",'FY22-23 Work Plan'!$E$11:$E$11)","v":"123 E Main St., Suite 100 \nAnytown, CA 90000"},{"$f":"IF(ISBLANK('FY22-23 Work Plan'!$J$11:$J$11),\"\",TEXT('FY22-23 Work Plan'!$J$11:$J$11,\"###-###-####\"))","v":"999-999-9999"},{"$f":"IF(ISBLANK('FY22-23 Work Plan'!$J$12:$J$12),\"\",'FY22-23 Work Plan'!$J$12:$J$12)","v":"www.abc2.org"},{"$f":"IF(ISBLANK('FY22-23 Work Plan'!$E$15:$E$15),\"\",'FY22-23 Work Plan'!$E$15:$E$15)","v":"John/Jane Doe"},{"$f":"IF(ISBLANK('FY22-23 Work Plan'!$H$15:$H$15),\"\",TEXT('FY22-23 Work Plan'!$H$15:$H$15,\"###-###-####\"))","v":"213-555-1212"},{"$f":"IF(ISBLANK('FY22-23 Work Plan'!$J$15:$J$15),\"\",'FY22-23 Work Plan'!$J$15:$J$15)","v":"janedoe@preventionusa.com"},{"$f":"IF(ISBLANK('FY22-23 Work Plan'!$E$16:$E$16),\"\",'FY22-23 Work Plan'!$E$16:$E$16)","v":"John/Jane Doe"},{"$f":"IF(ISBLANK('FY22-23 Work Plan'!$H$16:$H$16),\"\",TEXT('FY22-23 Work Plan'!$H$16:$H$16,\"###-###-####\"))","v":"213-555-1212"},{"$f":"IF(ISBLANK('FY22-23 Work Plan'!$J$16:$J$16),\"\",'FY22-23 Work Plan'!$J$16:$J$16)","v":"janedoe@preventionusa.com"},{"$f":"IF(ISBLANK('FY22-23 Work Plan'!$E$17:$E$17),\"\",'FY22-23 Work Plan'!$E$17:$E$17)","v":"John/Jane Doe"},{"$f":"IF(ISBLANK('FY22-23 Work Plan'!$H$17:$H$17),\"\",TEXT('FY22-23 Work Plan'!$H$17:$H$17,\"###-###-####\"))","v":"213-555-1212"},{"$f":"IF(ISBLANK('FY22-23 Work Plan'!$J$17:$J$17),\"\",'FY22-23 Work Plan'!$J$17:$J$17)","v":"j.doe@preventionusa.com"},{"$f":"IF(ISBLANK('FY22-23 Work Plan'!$E$18:$E$18),\"\",'FY22-23 Work Plan'!$E$18:$E$18)","v":"John/Jane Doe"},{"$f":"IF(ISBLANK('FY22-23 Work Plan'!$H$18:$H$18),\"\",TEXT('FY22-23 Work Plan'!$H$18:$H$18,\"###-###-####\"))","v":"213-555-1213"},{"$f":"IF(ISBLANK('FY22-23 Work Plan'!$J$18:$J$18),\"\",'FY22-23 Work Plan'!$J$18:$J$18)","v":"j.doe@preventionusa.com"},{"$f":"IF(ISBLANK('FY22-23 Work Plan'!$E$19:$E$19),\"\",'FY22-23 Work Plan'!$E$19:$E$19)","v":"John/Jane Doe"},{"$f":"IF(ISBLANK('FY22-23 Work Plan'!$H$19:$H$19),\"\",TEXT('FY22-23 Work Plan'!$H$19:$H$19,\"###-###-####\"))","v":"213-555-1213"},{"$f":"IF(ISBLANK('FY22-23 Work Plan'!$J$19:$J$19),\"\",'FY22-23 Work Plan'!$J$19:$J$19)","v":"j.doe@preventionusa.com"},{"$f":"IF(ISBLANK('FY22-23 Work Plan'!$D$23:$D$23),\"\",'FY22-23 Work Plan'!$D$23:$D$23)","v":""},{"$f":"IF(ISBLANK('FY22-23 Work Plan'!$H$23:$H$23),\"\",'FY22-23 Work Plan'!$H$23:$H$23)","v":""},{"$f":"IF(ISBLANK('FY22-23 Work Plan'!$D$24:$D$24),\"\",'FY22-23 Work Plan'!$D$24:$D$24)","v":""},{"$f":"IF(ISBLANK('FY22-23 Work Plan'!$H$24:$H$24),\"\",'FY22-23 Work Plan'!$H$24:$H$24)","v":""},{"$f":"IF(ISBLANK('FY22-23 Work Plan'!$D$25:$D$25),\"\",'FY22-23 Work Plan'!$D$25:$D$25)","v":""},{"$f":"IF(ISBLANK('FY22-23 Work Plan'!$H$25:$H$25),\"\",'FY22-23 Work Plan'!$H$25:$H$25)","v":""},{"$f":"IF(ISBLANK('FY22-23 Work Plan'!$D$26:$D$26),\"\",'FY22-23 Work Plan'!$D$26:$D$26)","v":""},{"$f":"IF(ISBLANK('FY22-23 Work Plan'!$H$26:$H$26),\"\",'FY22-23 Work Plan'!$H$26:$H$26)","v":""},{"$f":"IF(ISBLANK('FY22-23 Work Plan'!$D$27:$D$27),\"\",'FY22-23 Work Plan'!$D$27:$D$27)","v":""},{"$f":"IF(ISBLANK('FY22-23 Work Plan'!$H$27:$H$27),\"\",'FY22-23 Work Plan'!$H$27:$H$27)","v":""},{"$f":"IF(ISBLANK('FY22-23 Work Plan'!$D$28:$D$28),\"\",'FY22-23 Work Plan'!$D$28:$D$28)","v":""},{"$f":"IF(ISBLANK('FY22-23 Work Plan'!$H$28:$H$28),\"\",'FY22-23 Work Plan'!$H$28:$H$28)","v":""},{"$f":"IF(ISBLANK('FY22-23 Work Plan'!$D$29:$D$29),\"\",'FY22-23 Work Plan'!$D$29:$D$29)","v":""},{"$f":"IF(ISBLANK('FY22-23 Work Plan'!$H$29:$H$29),\"\",'FY22-23 Work Plan'!$H$29:$H$29)","v":""},{"$f":"IF(ISBLANK('FY22-23 Work Plan'!$B$30:$B$30),\"\",'FY22-23 Work Plan'!$B$30:$B$30)","v":""},{"$f":"IF(ISBLANK('FY22-23 Work Plan'!$D$30:$D$30),\"\",'FY22-23 Work Plan'!$D$30:$D$30)","v":""},{"$f":"IF(ISBLANK('FY22-23 Work Plan'!$H$30:$H$30),\"\",'FY22-23 Work Plan'!$H$30:$H$30)","v":""},{"$f":"IF(ISBLANK('FY22-23 Work Plan'!$B$31:$B$31),\"\",'FY22-23 Work Plan'!$B$31:$B$31)","v":""},{"$f":"IF(ISBLANK('FY22-23 Work Plan'!$D$31:$D$31),\"\",'FY22-23 Work Plan'!$D$31:$D$31)","v":""},{"$f":"IF(ISBLANK('FY22-23 Work Plan'!$H$31:$H$31),\"\",'FY22-23 Work Plan'!$H$31:$H$31)","v":""},{"$f":"IF(ISBLANK('FY22-23 Work Plan'!$B$32:$B$32),\"\",'FY22-23 Work Plan'!$B$32:$B$32)","v":""},{"$f":"IF(ISBLANK('FY22-23 Work Plan'!$D$32:$D$32),\"\",'FY22-23 Work Plan'!$D$32:$D$32)","v":""},{"$f":"IF(ISBLANK('FY22-23 Work Plan'!$H$32:$H$32),\"\",'FY22-23 Work Plan'!$H$32:$H$32)","v":""},{"$f":"IF(ISBLANK('FY22-23 Work Plan'!A57),\"\",'FY22-23 Work Plan'!A57)","v":""},{"$f":"IF(ISBLANK('FY22-23 Work Plan'!D57),\"\",'FY22-23 Work Plan'!D57)","v":""},{"$f":"IF(ISBLANK('FY22-23 Work Plan'!E57),\"\",'FY22-23 Work Plan'!E57)","v":""},{"$f":"IF(ISBLANK('FY22-23 Work Plan'!F57),\"\",'FY22-23 Work Plan'!F57)","v":""},{"$f":"IF(ISBLANK('FY22-23 Work Plan'!H57),\"\",'FY22-23 Work Plan'!H57)","v":""},{"$f":"IF(ISBLANK('FY22-23 Work Plan'!I57),\"\",'FY22-23 Work Plan'!I57)","v":""},{"$f":"IF(ISBLANK('FY22-23 Work Plan'!J57),\"\",'FY22-23 Work Plan'!J57)","v":""},{"$f":"IF(ISBLANK('FY22-23 Work Plan'!K57),\"\",'FY22-23 Work Plan'!K57)","v":""},{"$f":"IF(ISBLANK('FY22-23 Work Plan'!L57),\"\",'FY22-23 Work Plan'!L57)","v":""}]
[{"$f":"IF(ISBLANK('FY22-23 Work Plan'!$E$2:$E$2),\"\",'FY22-23 Work Plan'!$E$2:$E$2)","v":"Asian American Drug Abuse Programs, Inc. (AADAP)"},{"$f":"IF(ISBLANK('FY22-23 Work Plan'!$J$2:$J$2),\"\",'FY22-23 Work Plan'!$J$2:$J$2)","v":"Prevention Education Program (PEP)"},{"$f":"IF(ISBLANK('FY22-23 Work Plan'!$J$3:$J$3),\"\",'FY22-23 Work Plan'!$J$3:$J$3)","v":""},{"$f":"IF(ISBLANK('FY22-23 Work Plan'!$E$3:$E$3),\"\",'FY22-23 Work Plan'!$E$3:$E$3)","v":"PH-004367"},{"$f":"IF(ISBLANK('FY22-23 Work Plan'!$E$4:$E$4),\"\",TEXT('FY22-23 Work Plan'!$E$4:$E$4,\"000000\"))","v":"000001"},{"$f":"IF(ISBLANK('FY22-23 Work Plan'!$J$4:$J$4),\"\",'FY22-23 Work Plan'!$J$4:$J$4)","v":"Building Skills"},{"$f":"IF(ISBLANK('FY22-23 Work Plan'!$E$5:$E$5),\"\",'FY22-23 Work Plan'!$E$5:$E$5)","v":"2 - San Fernando Valley"},{"$f":"IF(ISBLANK('FY22-23 Work Plan'!$J$5:$J$5),\"\",'FY22-23 Work Plan'!$J$5:$J$5)","v":"3rd District, 4th District"},{"$f":"IF(ISBLANK('FY22-23 Work Plan'!$E$6:$E$6),\"\",'FY22-23 Work Plan'!$E$6:$E$6)","v":"Angeles National Forest*, Artesia, Altadena*"},{"$f":"IF(ISBLANK('FY22-23 Work Plan'!$E$7:$E$7),\"\",'FY22-23 Work Plan'!$E$7:$E$7)","v":"Cadillac-Corning, Angeles National Forest"},{"$f":"IF(ISBLANK('FY22-23 Work Plan'!$E$8:$E$8),\"\",'FY22-23 Work Plan'!$E$8:$E$8)","v":"90032, 90036"},{"$f":"IF(ISBLANK('FY22-23 Work Plan'!$E$9:$E$9),\"\",'FY22-23 Work Plan'!$E$9:$E$9)","v":"123 E Main St., Suite 100 \nAnytown, CA 90000"},{"$f":"IF(ISBLANK('FY22-23 Work Plan'!$J$9:$J$9),\"\",TEXT('FY22-23 Work Plan'!$J$9:$J$9,\"###-###-####\"))","v":"999-999-9999"},{"$f":"IF(ISBLANK('FY22-23 Work Plan'!$J$10:$J$10),\"\",'FY22-23 Work Plan'!$J$10:$J$10)","v":"www.abc1.org"},{"$f":"IF(ISBLANK('FY22-23 Work Plan'!$E$11:$E$11),\"\",'FY22-23 Work Plan'!$E$11:$E$11)","v":"123 E Main St., Suite 100 \nAnytown, CA 90000"},{"$f":"IF(ISBLANK('FY22-23 Work Plan'!$J$11:$J$11),\"\",TEXT('FY22-23 Work Plan'!$J$11:$J$11,\"###-###-####\"))","v":"999-999-9999"},{"$f":"IF(ISBLANK('FY22-23 Work Plan'!$J$12:$J$12),\"\",'FY22-23 Work Plan'!$J$12:$J$12)","v":"www.abc2.org"},{"$f":"IF(ISBLANK('FY22-23 Work Plan'!$E$15:$E$15),\"\",'FY22-23 Work Plan'!$E$15:$E$15)","v":"John/Jane Doe"},{"$f":"IF(ISBLANK('FY22-23 Work Plan'!$H$15:$H$15),\"\",TEXT('FY22-23 Work Plan'!$H$15:$H$15,\"###-###-####\"))","v":"213-555-1212"},{"$f":"IF(ISBLANK('FY22-23 Work Plan'!$J$15:$J$15),\"\",'FY22-23 Work Plan'!$J$15:$J$15)","v":"janedoe@preventionusa.com"},{"$f":"IF(ISBLANK('FY22-23 Work Plan'!$E$16:$E$16),\"\",'FY22-23 Work Plan'!$E$16:$E$16)","v":"John/Jane Doe"},{"$f":"IF(ISBLANK('FY22-23 Work Plan'!$H$16:$H$16),\"\",TEXT('FY22-23 Work Plan'!$H$16:$H$16,\"###-###-####\"))","v":"213-555-1212"},{"$f":"IF(ISBLANK('FY22-23 Work Plan'!$J$16:$J$16),\"\",'FY22-23 Work Plan'!$J$16:$J$16)","v":"janedoe@preventionusa.com"},{"$f":"IF(ISBLANK('FY22-23 Work Plan'!$E$17:$E$17),\"\",'FY22-23 Work Plan'!$E$17:$E$17)","v":"John/Jane Doe"},{"$f":"IF(ISBLANK('FY22-23 Work Plan'!$H$17:$H$17),\"\",TEXT('FY22-23 Work Plan'!$H$17:$H$17,\"###-###-####\"))","v":"213-555-1212"},{"$f":"IF(ISBLANK('FY22-23 Work Plan'!$J$17:$J$17),\"\",'FY22-23 Work Plan'!$J$17:$J$17)","v":"j.doe@preventionusa.com"},{"$f":"IF(ISBLANK('FY22-23 Work Plan'!$E$18:$E$18),\"\",'FY22-23 Work Plan'!$E$18:$E$18)","v":"John/Jane Doe"},{"$f":"IF(ISBLANK('FY22-23 Work Plan'!$H$18:$H$18),\"\",TEXT('FY22-23 Work Plan'!$H$18:$H$18,\"###-###-####\"))","v":"213-555-1213"},{"$f":"IF(ISBLANK('FY22-23 Work Plan'!$J$18:$J$18),\"\",'FY22-23 Work Plan'!$J$18:$J$18)","v":"j.doe@preventionusa.com"},{"$f":"IF(ISBLANK('FY22-23 Work Plan'!$E$19:$E$19),\"\",'FY22-23 Work Plan'!$E$19:$E$19)","v":"John/Jane Doe"},{"$f":"IF(ISBLANK('FY22-23 Work Plan'!$H$19:$H$19),\"\",TEXT('FY22-23 Work Plan'!$H$19:$H$19,\"###-###-####\"))","v":"213-555-1213"},{"$f":"IF(ISBLANK('FY22-23 Work Plan'!$J$19:$J$19),\"\",'FY22-23 Work Plan'!$J$19:$J$19)","v":"j.doe@preventionusa.com"},{"$f":"IF(ISBLANK('FY22-23 Work Plan'!$D$23:$D$23),\"\",'FY22-23 Work Plan'!$D$23:$D$23)","v":""},{"$f":"IF(ISBLANK('FY22-23 Work Plan'!$H$23:$H$23),\"\",'FY22-23 Work Plan'!$H$23:$H$23)","v":""},{"$f":"IF(ISBLANK('FY22-23 Work Plan'!$D$24:$D$24),\"\",'FY22-23 Work Plan'!$D$24:$D$24)","v":""},{"$f":"IF(ISBLANK('FY22-23 Work Plan'!$H$24:$H$24),\"\",'FY22-23 Work Plan'!$H$24:$H$24)","v":""},{"$f":"IF(ISBLANK('FY22-23 Work Plan'!$D$25:$D$25),\"\",'FY22-23 Work Plan'!$D$25:$D$25)","v":""},{"$f":"IF(ISBLANK('FY22-23 Work Plan'!$H$25:$H$25),\"\",'FY22-23 Work Plan'!$H$25:$H$25)","v":""},{"$f":"IF(ISBLANK('FY22-23 Work Plan'!$D$26:$D$26),\"\",'FY22-23 Work Plan'!$D$26:$D$26)","v":""},{"$f":"IF(ISBLANK('FY22-23 Work Plan'!$H$26:$H$26),\"\",'FY22-23 Work Plan'!$H$26:$H$26)","v":""},{"$f":"IF(ISBLANK('FY22-23 Work Plan'!$D$27:$D$27),\"\",'FY22-23 Work Plan'!$D$27:$D$27)","v":""},{"$f":"IF(ISBLANK('FY22-23 Work Plan'!$H$27:$H$27),\"\",'FY22-23 Work Plan'!$H$27:$H$27)","v":""},{"$f":"IF(ISBLANK('FY22-23 Work Plan'!$D$28:$D$28),\"\",'FY22-23 Work Plan'!$D$28:$D$28)","v":""},{"$f":"IF(ISBLANK('FY22-23 Work Plan'!$H$28:$H$28),\"\",'FY22-23 Work Plan'!$H$28:$H$28)","v":""},{"$f":"IF(ISBLANK('FY22-23 Work Plan'!$D$29:$D$29),\"\",'FY22-23 Work Plan'!$D$29:$D$29)","v":""},{"$f":"IF(ISBLANK('FY22-23 Work Plan'!$H$29:$H$29),\"\",'FY22-23 Work Plan'!$H$29:$H$29)","v":""},{"$f":"IF(ISBLANK('FY22-23 Work Plan'!$B$30:$B$30),\"\",'FY22-23 Work Plan'!$B$30:$B$30)","v":""},{"$f":"IF(ISBLANK('FY22-23 Work Plan'!$D$30:$D$30),\"\",'FY22-23 Work Plan'!$D$30:$D$30)","v":""},{"$f":"IF(ISBLANK('FY22-23 Work Plan'!$H$30:$H$30),\"\",'FY22-23 Work Plan'!$H$30:$H$30)","v":""},{"$f":"IF(ISBLANK('FY22-23 Work Plan'!$B$31:$B$31),\"\",'FY22-23 Work Plan'!$B$31:$B$31)","v":""},{"$f":"IF(ISBLANK('FY22-23 Work Plan'!$D$31:$D$31),\"\",'FY22-23 Work Plan'!$D$31:$D$31)","v":""},{"$f":"IF(ISBLANK('FY22-23 Work Plan'!$H$31:$H$31),\"\",'FY22-23 Work Plan'!$H$31:$H$31)","v":""},{"$f":"IF(ISBLANK('FY22-23 Work Plan'!$B$32:$B$32),\"\",'FY22-23 Work Plan'!$B$32:$B$32)","v":""},{"$f":"IF(ISBLANK('FY22-23 Work Plan'!$D$32:$D$32),\"\",'FY22-23 Work Plan'!$D$32:$D$32)","v":""},{"$f":"IF(ISBLANK('FY22-23 Work Plan'!$H$32:$H$32),\"\",'FY22-23 Work Plan'!$H$32:$H$32)","v":""},{"$f":"IF(ISBLANK('FY22-23 Work Plan'!A58),\"\",'FY22-23 Work Plan'!A58)","v":""},{"$f":"IF(ISBLANK('FY22-23 Work Plan'!D58),\"\",'FY22-23 Work Plan'!D58)","v":""},{"$f":"IF(ISBLANK('FY22-23 Work Plan'!E58),\"\",'FY22-23 Work Plan'!E58)","v":""},{"$f":"IF(ISBLANK('FY22-23 Work Plan'!F58),\"\",'FY22-23 Work Plan'!F58)","v":""},{"$f":"IF(ISBLANK('FY22-23 Work Plan'!H58),\"\",'FY22-23 Work Plan'!H58)","v":""},{"$f":"IF(ISBLANK('FY22-23 Work Plan'!I58),\"\",'FY22-23 Work Plan'!I58)","v":""},{"$f":"IF(ISBLANK('FY22-23 Work Plan'!J58),\"\",'FY22-23 Work Plan'!J58)","v":""},{"$f":"IF(ISBLANK('FY22-23 Work Plan'!K58),\"\",'FY22-23 Work Plan'!K58)","v":""},{"$f":"IF(ISBLANK('FY22-23 Work Plan'!L58),\"\",'FY22-23 Work Plan'!L58)","v":""}]
[{"$f":"IF(ISBLANK('FY22-23 Work Plan'!$E$2:$E$2),\"\",'FY22-23 Work Plan'!$E$2:$E$2)","v":"Asian American Drug Abuse Programs, Inc. (AADAP)"},{"$f":"IF(ISBLANK('FY22-23 Work Plan'!$J$2:$J$2),\"\",'FY22-23 Work Plan'!$J$2:$J$2)","v":"Prevention Education Program (PEP)"},{"$f":"IF(ISBLANK('FY22-23 Work Plan'!$J$3:$J$3),\"\",'FY22-23 Work Plan'!$J$3:$J$3)","v":""},{"$f":"IF(ISBLANK('FY22-23 Work Plan'!$E$3:$E$3),\"\",'FY22-23 Work Plan'!$E$3:$E$3)","v":"PH-004367"},{"$f":"IF(ISBLANK('FY22-23 Work Plan'!$E$4:$E$4),\"\",TEXT('FY22-23 Work Plan'!$E$4:$E$4,\"000000\"))","v":"000001"},{"$f":"IF(ISBLANK('FY22-23 Work Plan'!$J$4:$J$4),\"\",'FY22-23 Work Plan'!$J$4:$J$4)","v":"Building Skills"},{"$f":"IF(ISBLANK('FY22-23 Work Plan'!$E$5:$E$5),\"\",'FY22-23 Work Plan'!$E$5:$E$5)","v":"2 - San Fernando Valley"},{"$f":"IF(ISBLANK('FY22-23 Work Plan'!$J$5:$J$5),\"\",'FY22-23 Work Plan'!$J$5:$J$5)","v":"3rd District, 4th District"},{"$f":"IF(ISBLANK('FY22-23 Work Plan'!$E$6:$E$6),\"\",'FY22-23 Work Plan'!$E$6:$E$6)","v":"Angeles National Forest*, Artesia, Altadena*"},{"$f":"IF(ISBLANK('FY22-23 Work Plan'!$E$7:$E$7),\"\",'FY22-23 Work Plan'!$E$7:$E$7)","v":"Cadillac-Corning, Angeles National Forest"},{"$f":"IF(ISBLANK('FY22-23 Work Plan'!$E$8:$E$8),\"\",'FY22-23 Work Plan'!$E$8:$E$8)","v":"90032, 90036"},{"$f":"IF(ISBLANK('FY22-23 Work Plan'!$E$9:$E$9),\"\",'FY22-23 Work Plan'!$E$9:$E$9)","v":"123 E Main St., Suite 100 \nAnytown, CA 90000"},{"$f":"IF(ISBLANK('FY22-23 Work Plan'!$J$9:$J$9),\"\",TEXT('FY22-23 Work Plan'!$J$9:$J$9,\"###-###-####\"))","v":"999-999-9999"},{"$f":"IF(ISBLANK('FY22-23 Work Plan'!$J$10:$J$10),\"\",'FY22-23 Work Plan'!$J$10:$J$10)","v":"www.abc1.org"},{"$f":"IF(ISBLANK('FY22-23 Work Plan'!$E$11:$E$11),\"\",'FY22-23 Work Plan'!$E$11:$E$11)","v":"123 E Main St., Suite 100 \nAnytown, CA 90000"},{"$f":"IF(ISBLANK('FY22-23 Work Plan'!$J$11:$J$11),\"\",TEXT('FY22-23 Work Plan'!$J$11:$J$11,\"###-###-####\"))","v":"999-999-9999"},{"$f":"IF(ISBLANK('FY22-23 Work Plan'!$J$12:$J$12),\"\",'FY22-23 Work Plan'!$J$12:$J$12)","v":"www.abc2.org"},{"$f":"IF(ISBLANK('FY22-23 Work Plan'!$E$15:$E$15),\"\",'FY22-23 Work Plan'!$E$15:$E$15)","v":"John/Jane Doe"},{"$f":"IF(ISBLANK('FY22-23 Work Plan'!$H$15:$H$15),\"\",TEXT('FY22-23 Work Plan'!$H$15:$H$15,\"###-###-####\"))","v":"213-555-1212"},{"$f":"IF(ISBLANK('FY22-23 Work Plan'!$J$15:$J$15),\"\",'FY22-23 Work Plan'!$J$15:$J$15)","v":"janedoe@preventionusa.com"},{"$f":"IF(ISBLANK('FY22-23 Work Plan'!$E$16:$E$16),\"\",'FY22-23 Work Plan'!$E$16:$E$16)","v":"John/Jane Doe"},{"$f":"IF(ISBLANK('FY22-23 Work Plan'!$H$16:$H$16),\"\",TEXT('FY22-23 Work Plan'!$H$16:$H$16,\"###-###-####\"))","v":"213-555-1212"},{"$f":"IF(ISBLANK('FY22-23 Work Plan'!$J$16:$J$16),\"\",'FY22-23 Work Plan'!$J$16:$J$16)","v":"janedoe@preventionusa.com"},{"$f":"IF(ISBLANK('FY22-23 Work Plan'!$E$17:$E$17),\"\",'FY22-23 Work Plan'!$E$17:$E$17)","v":"John/Jane Doe"},{"$f":"IF(ISBLANK('FY22-23 Work Plan'!$H$17:$H$17),\"\",TEXT('FY22-23 Work Plan'!$H$17:$H$17,\"###-###-####\"))","v":"213-555-1212"},{"$f":"IF(ISBLANK('FY22-23 Work Plan'!$J$17:$J$17),\"\",'FY22-23 Work Plan'!$J$17:$J$17)","v":"j.doe@preventionusa.com"},{"$f":"IF(ISBLANK('FY22-23 Work Plan'!$E$18:$E$18),\"\",'FY22-23 Work Plan'!$E$18:$E$18)","v":"John/Jane Doe"},{"$f":"IF(ISBLANK('FY22-23 Work Plan'!$H$18:$H$18),\"\",TEXT('FY22-23 Work Plan'!$H$18:$H$18,\"###-###-####\"))","v":"213-555-1213"},{"$f":"IF(ISBLANK('FY22-23 Work Plan'!$J$18:$J$18),\"\",'FY22-23 Work Plan'!$J$18:$J$18)","v":"j.doe@preventionusa.com"},{"$f":"IF(ISBLANK('FY22-23 Work Plan'!$E$19:$E$19),\"\",'FY22-23 Work Plan'!$E$19:$E$19)","v":"John/Jane Doe"},{"$f":"IF(ISBLANK('FY22-23 Work Plan'!$H$19:$H$19),\"\",TEXT('FY22-23 Work Plan'!$H$19:$H$19,\"###-###-####\"))","v":"213-555-1213"},{"$f":"IF(ISBLANK('FY22-23 Work Plan'!$J$19:$J$19),\"\",'FY22-23 Work Plan'!$J$19:$J$19)","v":"j.doe@preventionusa.com"},{"$f":"IF(ISBLANK('FY22-23 Work Plan'!$D$23:$D$23),\"\",'FY22-23 Work Plan'!$D$23:$D$23)","v":""},{"$f":"IF(ISBLANK('FY22-23 Work Plan'!$H$23:$H$23),\"\",'FY22-23 Work Plan'!$H$23:$H$23)","v":""},{"$f":"IF(ISBLANK('FY22-23 Work Plan'!$D$24:$D$24),\"\",'FY22-23 Work Plan'!$D$24:$D$24)","v":""},{"$f":"IF(ISBLANK('FY22-23 Work Plan'!$H$24:$H$24),\"\",'FY22-23 Work Plan'!$H$24:$H$24)","v":""},{"$f":"IF(ISBLANK('FY22-23 Work Plan'!$D$25:$D$25),\"\",'FY22-23 Work Plan'!$D$25:$D$25)","v":""},{"$f":"IF(ISBLANK('FY22-23 Work Plan'!$H$25:$H$25),\"\",'FY22-23 Work Plan'!$H$25:$H$25)","v":""},{"$f":"IF(ISBLANK('FY22-23 Work Plan'!$D$26:$D$26),\"\",'FY22-23 Work Plan'!$D$26:$D$26)","v":""},{"$f":"IF(ISBLANK('FY22-23 Work Plan'!$H$26:$H$26),\"\",'FY22-23 Work Plan'!$H$26:$H$26)","v":""},{"$f":"IF(ISBLANK('FY22-23 Work Plan'!$D$27:$D$27),\"\",'FY22-23 Work Plan'!$D$27:$D$27)","v":""},{"$f":"IF(ISBLANK('FY22-23 Work Plan'!$H$27:$H$27),\"\",'FY22-23 Work Plan'!$H$27:$H$27)","v":""},{"$f":"IF(ISBLANK('FY22-23 Work Plan'!$D$28:$D$28),\"\",'FY22-23 Work Plan'!$D$28:$D$28)","v":""},{"$f":"IF(ISBLANK('FY22-23 Work Plan'!$H$28:$H$28),\"\",'FY22-23 Work Plan'!$H$28:$H$28)","v":""},{"$f":"IF(ISBLANK('FY22-23 Work Plan'!$D$29:$D$29),\"\",'FY22-23 Work Plan'!$D$29:$D$29)","v":""},{"$f":"IF(ISBLANK('FY22-23 Work Plan'!$H$29:$H$29),\"\",'FY22-23 Work Plan'!$H$29:$H$29)","v":""},{"$f":"IF(ISBLANK('FY22-23 Work Plan'!$B$30:$B$30),\"\",'FY22-23 Work Plan'!$B$30:$B$30)","v":""},{"$f":"IF(ISBLANK('FY22-23 Work Plan'!$D$30:$D$30),\"\",'FY22-23 Work Plan'!$D$30:$D$30)","v":""},{"$f":"IF(ISBLANK('FY22-23 Work Plan'!$H$30:$H$30),\"\",'FY22-23 Work Plan'!$H$30:$H$30)","v":""},{"$f":"IF(ISBLANK('FY22-23 Work Plan'!$B$31:$B$31),\"\",'FY22-23 Work Plan'!$B$31:$B$31)","v":""},{"$f":"IF(ISBLANK('FY22-23 Work Plan'!$D$31:$D$31),\"\",'FY22-23 Work Plan'!$D$31:$D$31)","v":""},{"$f":"IF(ISBLANK('FY22-23 Work Plan'!$H$31:$H$31),\"\",'FY22-23 Work Plan'!$H$31:$H$31)","v":""},{"$f":"IF(ISBLANK('FY22-23 Work Plan'!$B$32:$B$32),\"\",'FY22-23 Work Plan'!$B$32:$B$32)","v":""},{"$f":"IF(ISBLANK('FY22-23 Work Plan'!$D$32:$D$32),\"\",'FY22-23 Work Plan'!$D$32:$D$32)","v":""},{"$f":"IF(ISBLANK('FY22-23 Work Plan'!$H$32:$H$32),\"\",'FY22-23 Work Plan'!$H$32:$H$32)","v":""},{"$f":"IF(ISBLANK('FY22-23 Work Plan'!A59),\"\",'FY22-23 Work Plan'!A59)","v":""},{"$f":"IF(ISBLANK('FY22-23 Work Plan'!D59),\"\",'FY22-23 Work Plan'!D59)","v":""},{"$f":"IF(ISBLANK('FY22-23 Work Plan'!E59),\"\",'FY22-23 Work Plan'!E59)","v":""},{"$f":"IF(ISBLANK('FY22-23 Work Plan'!F59),\"\",'FY22-23 Work Plan'!F59)","v":""},{"$f":"IF(ISBLANK('FY22-23 Work Plan'!H59),\"\",'FY22-23 Work Plan'!H59)","v":""},{"$f":"IF(ISBLANK('FY22-23 Work Plan'!I59),\"\",'FY22-23 Work Plan'!I59)","v":""},{"$f":"IF(ISBLANK('FY22-23 Work Plan'!J59),\"\",'FY22-23 Work Plan'!J59)","v":""},{"$f":"IF(ISBLANK('FY22-23 Work Plan'!K59),\"\",'FY22-23 Work Plan'!K59)","v":""},{"$f":"IF(ISBLANK('FY22-23 Work Plan'!L59),\"\",'FY22-23 Work Plan'!L59)","v":""}]
[{"$f":"IF(ISBLANK('FY22-23 Work Plan'!$E$2:$E$2),\"\",'FY22-23 Work Plan'!$E$2:$E$2)","v":"Asian American Drug Abuse Programs, Inc. (AADAP)"},{"$f":"IF(ISBLANK('FY22-23 Work Plan'!$J$2:$J$2),\"\",'FY22-23 Work Plan'!$J$2:$J$2)","v":"Prevention Education Program (PEP)"},{"$f":"IF(ISBLANK('FY22-23 Work Plan'!$J$3:$J$3),\"\",'FY22-23 Work Plan'!$J$3:$J$3)","v":""},{"$f":"IF(ISBLANK('FY22-23 Work Plan'!$E$3:$E$3),\"\",'FY22-23 Work Plan'!$E$3:$E$3)","v":"PH-004367"},{"$f":"IF(ISBLANK('FY22-23 Work Plan'!$E$4:$E$4),\"\",TEXT('FY22-23 Work Plan'!$E$4:$E$4,\"000000\"))","v":"000001"},{"$f":"IF(ISBLANK('FY22-23 Work Plan'!$J$4:$J$4),\"\",'FY22-23 Work Plan'!$J$4:$J$4)","v":"Building Skills"},{"$f":"IF(ISBLANK('FY22-23 Work Plan'!$E$5:$E$5),\"\",'FY22-23 Work Plan'!$E$5:$E$5)","v":"2 - San Fernando Valley"},{"$f":"IF(ISBLANK('FY22-23 Work Plan'!$J$5:$J$5),\"\",'FY22-23 Work Plan'!$J$5:$J$5)","v":"3rd District, 4th District"},{"$f":"IF(ISBLANK('FY22-23 Work Plan'!$E$6:$E$6),\"\",'FY22-23 Work Plan'!$E$6:$E$6)","v":"Angeles National Forest*, Artesia, Altadena*"},{"$f":"IF(ISBLANK('FY22-23 Work Plan'!$E$7:$E$7),\"\",'FY22-23 Work Plan'!$E$7:$E$7)","v":"Cadillac-Corning, Angeles National Forest"},{"$f":"IF(ISBLANK('FY22-23 Work Plan'!$E$8:$E$8),\"\",'FY22-23 Work Plan'!$E$8:$E$8)","v":"90032, 90036"},{"$f":"IF(ISBLANK('FY22-23 Work Plan'!$E$9:$E$9),\"\",'FY22-23 Work Plan'!$E$9:$E$9)","v":"123 E Main St., Suite 100 \nAnytown, CA 90000"},{"$f":"IF(ISBLANK('FY22-23 Work Plan'!$J$9:$J$9),\"\",TEXT('FY22-23 Work Plan'!$J$9:$J$9,\"###-###-####\"))","v":"999-999-9999"},{"$f":"IF(ISBLANK('FY22-23 Work Plan'!$J$10:$J$10),\"\",'FY22-23 Work Plan'!$J$10:$J$10)","v":"www.abc1.org"},{"$f":"IF(ISBLANK('FY22-23 Work Plan'!$E$11:$E$11),\"\",'FY22-23 Work Plan'!$E$11:$E$11)","v":"123 E Main St., Suite 100 \nAnytown, CA 90000"},{"$f":"IF(ISBLANK('FY22-23 Work Plan'!$J$11:$J$11),\"\",TEXT('FY22-23 Work Plan'!$J$11:$J$11,\"###-###-####\"))","v":"999-999-9999"},{"$f":"IF(ISBLANK('FY22-23 Work Plan'!$J$12:$J$12),\"\",'FY22-23 Work Plan'!$J$12:$J$12)","v":"www.abc2.org"},{"$f":"IF(ISBLANK('FY22-23 Work Plan'!$E$15:$E$15),\"\",'FY22-23 Work Plan'!$E$15:$E$15)","v":"John/Jane Doe"},{"$f":"IF(ISBLANK('FY22-23 Work Plan'!$H$15:$H$15),\"\",TEXT('FY22-23 Work Plan'!$H$15:$H$15,\"###-###-####\"))","v":"213-555-1212"},{"$f":"IF(ISBLANK('FY22-23 Work Plan'!$J$15:$J$15),\"\",'FY22-23 Work Plan'!$J$15:$J$15)","v":"janedoe@preventionusa.com"},{"$f":"IF(ISBLANK('FY22-23 Work Plan'!$E$16:$E$16),\"\",'FY22-23 Work Plan'!$E$16:$E$16)","v":"John/Jane Doe"},{"$f":"IF(ISBLANK('FY22-23 Work Plan'!$H$16:$H$16),\"\",TEXT('FY22-23 Work Plan'!$H$16:$H$16,\"###-###-####\"))","v":"213-555-1212"},{"$f":"IF(ISBLANK('FY22-23 Work Plan'!$J$16:$J$16),\"\",'FY22-23 Work Plan'!$J$16:$J$16)","v":"janedoe@preventionusa.com"},{"$f":"IF(ISBLANK('FY22-23 Work Plan'!$E$17:$E$17),\"\",'FY22-23 Work Plan'!$E$17:$E$17)","v":"John/Jane Doe"},{"$f":"IF(ISBLANK('FY22-23 Work Plan'!$H$17:$H$17),\"\",TEXT('FY22-23 Work Plan'!$H$17:$H$17,\"###-###-####\"))","v":"213-555-1212"},{"$f":"IF(ISBLANK('FY22-23 Work Plan'!$J$17:$J$17),\"\",'FY22-23 Work Plan'!$J$17:$J$17)","v":"j.doe@preventionusa.com"},{"$f":"IF(ISBLANK('FY22-23 Work Plan'!$E$18:$E$18),\"\",'FY22-23 Work Plan'!$E$18:$E$18)","v":"John/Jane Doe"},{"$f":"IF(ISBLANK('FY22-23 Work Plan'!$H$18:$H$18),\"\",TEXT('FY22-23 Work Plan'!$H$18:$H$18,\"###-###-####\"))","v":"213-555-1213"},{"$f":"IF(ISBLANK('FY22-23 Work Plan'!$J$18:$J$18),\"\",'FY22-23 Work Plan'!$J$18:$J$18)","v":"j.doe@preventionusa.com"},{"$f":"IF(ISBLANK('FY22-23 Work Plan'!$E$19:$E$19),\"\",'FY22-23 Work Plan'!$E$19:$E$19)","v":"John/Jane Doe"},{"$f":"IF(ISBLANK('FY22-23 Work Plan'!$H$19:$H$19),\"\",TEXT('FY22-23 Work Plan'!$H$19:$H$19,\"###-###-####\"))","v":"213-555-1213"},{"$f":"IF(ISBLANK('FY22-23 Work Plan'!$J$19:$J$19),\"\",'FY22-23 Work Plan'!$J$19:$J$19)","v":"j.doe@preventionusa.com"},{"$f":"IF(ISBLANK('FY22-23 Work Plan'!$D$23:$D$23),\"\",'FY22-23 Work Plan'!$D$23:$D$23)","v":""},{"$f":"IF(ISBLANK('FY22-23 Work Plan'!$H$23:$H$23),\"\",'FY22-23 Work Plan'!$H$23:$H$23)","v":""},{"$f":"IF(ISBLANK('FY22-23 Work Plan'!$D$24:$D$24),\"\",'FY22-23 Work Plan'!$D$24:$D$24)","v":""},{"$f":"IF(ISBLANK('FY22-23 Work Plan'!$H$24:$H$24),\"\",'FY22-23 Work Plan'!$H$24:$H$24)","v":""},{"$f":"IF(ISBLANK('FY22-23 Work Plan'!$D$25:$D$25),\"\",'FY22-23 Work Plan'!$D$25:$D$25)","v":""},{"$f":"IF(ISBLANK('FY22-23 Work Plan'!$H$25:$H$25),\"\",'FY22-23 Work Plan'!$H$25:$H$25)","v":""},{"$f":"IF(ISBLANK('FY22-23 Work Plan'!$D$26:$D$26),\"\",'FY22-23 Work Plan'!$D$26:$D$26)","v":""},{"$f":"IF(ISBLANK('FY22-23 Work Plan'!$H$26:$H$26),\"\",'FY22-23 Work Plan'!$H$26:$H$26)","v":""},{"$f":"IF(ISBLANK('FY22-23 Work Plan'!$D$27:$D$27),\"\",'FY22-23 Work Plan'!$D$27:$D$27)","v":""},{"$f":"IF(ISBLANK('FY22-23 Work Plan'!$H$27:$H$27),\"\",'FY22-23 Work Plan'!$H$27:$H$27)","v":""},{"$f":"IF(ISBLANK('FY22-23 Work Plan'!$D$28:$D$28),\"\",'FY22-23 Work Plan'!$D$28:$D$28)","v":""},{"$f":"IF(ISBLANK('FY22-23 Work Plan'!$H$28:$H$28),\"\",'FY22-23 Work Plan'!$H$28:$H$28)","v":""},{"$f":"IF(ISBLANK('FY22-23 Work Plan'!$D$29:$D$29),\"\",'FY22-23 Work Plan'!$D$29:$D$29)","v":""},{"$f":"IF(ISBLANK('FY22-23 Work Plan'!$H$29:$H$29),\"\",'FY22-23 Work Plan'!$H$29:$H$29)","v":""},{"$f":"IF(ISBLANK('FY22-23 Work Plan'!$B$30:$B$30),\"\",'FY22-23 Work Plan'!$B$30:$B$30)","v":""},{"$f":"IF(ISBLANK('FY22-23 Work Plan'!$D$30:$D$30),\"\",'FY22-23 Work Plan'!$D$30:$D$30)","v":""},{"$f":"IF(ISBLANK('FY22-23 Work Plan'!$H$30:$H$30),\"\",'FY22-23 Work Plan'!$H$30:$H$30)","v":""},{"$f":"IF(ISBLANK('FY22-23 Work Plan'!$B$31:$B$31),\"\",'FY22-23 Work Plan'!$B$31:$B$31)","v":""},{"$f":"IF(ISBLANK('FY22-23 Work Plan'!$D$31:$D$31),\"\",'FY22-23 Work Plan'!$D$31:$D$31)","v":""},{"$f":"IF(ISBLANK('FY22-23 Work Plan'!$H$31:$H$31),\"\",'FY22-23 Work Plan'!$H$31:$H$31)","v":""},{"$f":"IF(ISBLANK('FY22-23 Work Plan'!$B$32:$B$32),\"\",'FY22-23 Work Plan'!$B$32:$B$32)","v":""},{"$f":"IF(ISBLANK('FY22-23 Work Plan'!$D$32:$D$32),\"\",'FY22-23 Work Plan'!$D$32:$D$32)","v":""},{"$f":"IF(ISBLANK('FY22-23 Work Plan'!$H$32:$H$32),\"\",'FY22-23 Work Plan'!$H$32:$H$32)","v":""},{"$f":"IF(ISBLANK('FY22-23 Work Plan'!A60),\"\",'FY22-23 Work Plan'!A60)","v":""},{"$f":"IF(ISBLANK('FY22-23 Work Plan'!D60),\"\",'FY22-23 Work Plan'!D60)","v":""},{"$f":"IF(ISBLANK('FY22-23 Work Plan'!E60),\"\",'FY22-23 Work Plan'!E60)","v":""},{"$f":"IF(ISBLANK('FY22-23 Work Plan'!F60),\"\",'FY22-23 Work Plan'!F60)","v":""},{"$f":"IF(ISBLANK('FY22-23 Work Plan'!H60),\"\",'FY22-23 Work Plan'!H60)","v":""},{"$f":"IF(ISBLANK('FY22-23 Work Plan'!I60),\"\",'FY22-23 Work Plan'!I60)","v":""},{"$f":"IF(ISBLANK('FY22-23 Work Plan'!J60),\"\",'FY22-23 Work Plan'!J60)","v":""},{"$f":"IF(ISBLANK('FY22-23 Work Plan'!K60),\"\",'FY22-23 Work Plan'!K60)","v":""},{"$f":"IF(ISBLANK('FY22-23 Work Plan'!L60),\"\",'FY22-23 Work Plan'!L60)","v":""}]
[{"$f":"IF(ISBLANK('FY22-23 Work Plan'!$E$2:$E$2),\"\",'FY22-23 Work Plan'!$E$2:$E$2)","v":"Asian American Drug Abuse Programs, Inc. (AADAP)"},{"$f":"IF(ISBLANK('FY22-23 Work Plan'!$J$2:$J$2),\"\",'FY22-23 Work Plan'!$J$2:$J$2)","v":"Prevention Education Program (PEP)"},{"$f":"IF(ISBLANK('FY22-23 Work Plan'!$J$3:$J$3),\"\",'FY22-23 Work Plan'!$J$3:$J$3)","v":""},{"$f":"IF(ISBLANK('FY22-23 Work Plan'!$E$3:$E$3),\"\",'FY22-23 Work Plan'!$E$3:$E$3)","v":"PH-004367"},{"$f":"IF(ISBLANK('FY22-23 Work Plan'!$E$4:$E$4),\"\",TEXT('FY22-23 Work Plan'!$E$4:$E$4,\"000000\"))","v":"000001"},{"$f":"IF(ISBLANK('FY22-23 Work Plan'!$J$4:$J$4),\"\",'FY22-23 Work Plan'!$J$4:$J$4)","v":"Building Skills"},{"$f":"IF(ISBLANK('FY22-23 Work Plan'!$E$5:$E$5),\"\",'FY22-23 Work Plan'!$E$5:$E$5)","v":"2 - San Fernando Valley"},{"$f":"IF(ISBLANK('FY22-23 Work Plan'!$J$5:$J$5),\"\",'FY22-23 Work Plan'!$J$5:$J$5)","v":"3rd District, 4th District"},{"$f":"IF(ISBLANK('FY22-23 Work Plan'!$E$6:$E$6),\"\",'FY22-23 Work Plan'!$E$6:$E$6)","v":"Angeles National Forest*, Artesia, Altadena*"},{"$f":"IF(ISBLANK('FY22-23 Work Plan'!$E$7:$E$7),\"\",'FY22-23 Work Plan'!$E$7:$E$7)","v":"Cadillac-Corning, Angeles National Forest"},{"$f":"IF(ISBLANK('FY22-23 Work Plan'!$E$8:$E$8),\"\",'FY22-23 Work Plan'!$E$8:$E$8)","v":"90032, 90036"},{"$f":"IF(ISBLANK('FY22-23 Work Plan'!$E$9:$E$9),\"\",'FY22-23 Work Plan'!$E$9:$E$9)","v":"123 E Main St., Suite 100 \nAnytown, CA 90000"},{"$f":"IF(ISBLANK('FY22-23 Work Plan'!$J$9:$J$9),\"\",TEXT('FY22-23 Work Plan'!$J$9:$J$9,\"###-###-####\"))","v":"999-999-9999"},{"$f":"IF(ISBLANK('FY22-23 Work Plan'!$J$10:$J$10),\"\",'FY22-23 Work Plan'!$J$10:$J$10)","v":"www.abc1.org"},{"$f":"IF(ISBLANK('FY22-23 Work Plan'!$E$11:$E$11),\"\",'FY22-23 Work Plan'!$E$11:$E$11)","v":"123 E Main St., Suite 100 \nAnytown, CA 90000"},{"$f":"IF(ISBLANK('FY22-23 Work Plan'!$J$11:$J$11),\"\",TEXT('FY22-23 Work Plan'!$J$11:$J$11,\"###-###-####\"))","v":"999-999-9999"},{"$f":"IF(ISBLANK('FY22-23 Work Plan'!$J$12:$J$12),\"\",'FY22-23 Work Plan'!$J$12:$J$12)","v":"www.abc2.org"},{"$f":"IF(ISBLANK('FY22-23 Work Plan'!$E$15:$E$15),\"\",'FY22-23 Work Plan'!$E$15:$E$15)","v":"John/Jane Doe"},{"$f":"IF(ISBLANK('FY22-23 Work Plan'!$H$15:$H$15),\"\",TEXT('FY22-23 Work Plan'!$H$15:$H$15,\"###-###-####\"))","v":"213-555-1212"},{"$f":"IF(ISBLANK('FY22-23 Work Plan'!$J$15:$J$15),\"\",'FY22-23 Work Plan'!$J$15:$J$15)","v":"janedoe@preventionusa.com"},{"$f":"IF(ISBLANK('FY22-23 Work Plan'!$E$16:$E$16),\"\",'FY22-23 Work Plan'!$E$16:$E$16)","v":"John/Jane Doe"},{"$f":"IF(ISBLANK('FY22-23 Work Plan'!$H$16:$H$16),\"\",TEXT('FY22-23 Work Plan'!$H$16:$H$16,\"###-###-####\"))","v":"213-555-1212"},{"$f":"IF(ISBLANK('FY22-23 Work Plan'!$J$16:$J$16),\"\",'FY22-23 Work Plan'!$J$16:$J$16)","v":"janedoe@preventionusa.com"},{"$f":"IF(ISBLANK('FY22-23 Work Plan'!$E$17:$E$17),\"\",'FY22-23 Work Plan'!$E$17:$E$17)","v":"John/Jane Doe"},{"$f":"IF(ISBLANK('FY22-23 Work Plan'!$H$17:$H$17),\"\",TEXT('FY22-23 Work Plan'!$H$17:$H$17,\"###-###-####\"))","v":"213-555-1212"},{"$f":"IF(ISBLANK('FY22-23 Work Plan'!$J$17:$J$17),\"\",'FY22-23 Work Plan'!$J$17:$J$17)","v":"j.doe@preventionusa.com"},{"$f":"IF(ISBLANK('FY22-23 Work Plan'!$E$18:$E$18),\"\",'FY22-23 Work Plan'!$E$18:$E$18)","v":"John/Jane Doe"},{"$f":"IF(ISBLANK('FY22-23 Work Plan'!$H$18:$H$18),\"\",TEXT('FY22-23 Work Plan'!$H$18:$H$18,\"###-###-####\"))","v":"213-555-1213"},{"$f":"IF(ISBLANK('FY22-23 Work Plan'!$J$18:$J$18),\"\",'FY22-23 Work Plan'!$J$18:$J$18)","v":"j.doe@preventionusa.com"},{"$f":"IF(ISBLANK('FY22-23 Work Plan'!$E$19:$E$19),\"\",'FY22-23 Work Plan'!$E$19:$E$19)","v":"John/Jane Doe"},{"$f":"IF(ISBLANK('FY22-23 Work Plan'!$H$19:$H$19),\"\",TEXT('FY22-23 Work Plan'!$H$19:$H$19,\"###-###-####\"))","v":"213-555-1213"},{"$f":"IF(ISBLANK('FY22-23 Work Plan'!$J$19:$J$19),\"\",'FY22-23 Work Plan'!$J$19:$J$19)","v":"j.doe@preventionusa.com"},{"$f":"IF(ISBLANK('FY22-23 Work Plan'!$D$23:$D$23),\"\",'FY22-23 Work Plan'!$D$23:$D$23)","v":""},{"$f":"IF(ISBLANK('FY22-23 Work Plan'!$H$23:$H$23),\"\",'FY22-23 Work Plan'!$H$23:$H$23)","v":""},{"$f":"IF(ISBLANK('FY22-23 Work Plan'!$D$24:$D$24),\"\",'FY22-23 Work Plan'!$D$24:$D$24)","v":""},{"$f":"IF(ISBLANK('FY22-23 Work Plan'!$H$24:$H$24),\"\",'FY22-23 Work Plan'!$H$24:$H$24)","v":""},{"$f":"IF(ISBLANK('FY22-23 Work Plan'!$D$25:$D$25),\"\",'FY22-23 Work Plan'!$D$25:$D$25)","v":""},{"$f":"IF(ISBLANK('FY22-23 Work Plan'!$H$25:$H$25),\"\",'FY22-23 Work Plan'!$H$25:$H$25)","v":""},{"$f":"IF(ISBLANK('FY22-23 Work Plan'!$D$26:$D$26),\"\",'FY22-23 Work Plan'!$D$26:$D$26)","v":""},{"$f":"IF(ISBLANK('FY22-23 Work Plan'!$H$26:$H$26),\"\",'FY22-23 Work Plan'!$H$26:$H$26)","v":""},{"$f":"IF(ISBLANK('FY22-23 Work Plan'!$D$27:$D$27),\"\",'FY22-23 Work Plan'!$D$27:$D$27)","v":""},{"$f":"IF(ISBLANK('FY22-23 Work Plan'!$H$27:$H$27),\"\",'FY22-23 Work Plan'!$H$27:$H$27)","v":""},{"$f":"IF(ISBLANK('FY22-23 Work Plan'!$D$28:$D$28),\"\",'FY22-23 Work Plan'!$D$28:$D$28)","v":""},{"$f":"IF(ISBLANK('FY22-23 Work Plan'!$H$28:$H$28),\"\",'FY22-23 Work Plan'!$H$28:$H$28)","v":""},{"$f":"IF(ISBLANK('FY22-23 Work Plan'!$D$29:$D$29),\"\",'FY22-23 Work Plan'!$D$29:$D$29)","v":""},{"$f":"IF(ISBLANK('FY22-23 Work Plan'!$H$29:$H$29),\"\",'FY22-23 Work Plan'!$H$29:$H$29)","v":""},{"$f":"IF(ISBLANK('FY22-23 Work Plan'!$B$30:$B$30),\"\",'FY22-23 Work Plan'!$B$30:$B$30)","v":""},{"$f":"IF(ISBLANK('FY22-23 Work Plan'!$D$30:$D$30),\"\",'FY22-23 Work Plan'!$D$30:$D$30)","v":""},{"$f":"IF(ISBLANK('FY22-23 Work Plan'!$H$30:$H$30),\"\",'FY22-23 Work Plan'!$H$30:$H$30)","v":""},{"$f":"IF(ISBLANK('FY22-23 Work Plan'!$B$31:$B$31),\"\",'FY22-23 Work Plan'!$B$31:$B$31)","v":""},{"$f":"IF(ISBLANK('FY22-23 Work Plan'!$D$31:$D$31),\"\",'FY22-23 Work Plan'!$D$31:$D$31)","v":""},{"$f":"IF(ISBLANK('FY22-23 Work Plan'!$H$31:$H$31),\"\",'FY22-23 Work Plan'!$H$31:$H$31)","v":""},{"$f":"IF(ISBLANK('FY22-23 Work Plan'!$B$32:$B$32),\"\",'FY22-23 Work Plan'!$B$32:$B$32)","v":""},{"$f":"IF(ISBLANK('FY22-23 Work Plan'!$D$32:$D$32),\"\",'FY22-23 Work Plan'!$D$32:$D$32)","v":""},{"$f":"IF(ISBLANK('FY22-23 Work Plan'!$H$32:$H$32),\"\",'FY22-23 Work Plan'!$H$32:$H$32)","v":""},{"$f":"IF(ISBLANK('FY22-23 Work Plan'!A61),\"\",'FY22-23 Work Plan'!A61)","v":""},{"$f":"IF(ISBLANK('FY22-23 Work Plan'!D61),\"\",'FY22-23 Work Plan'!D61)","v":""},{"$f":"IF(ISBLANK('FY22-23 Work Plan'!E61),\"\",'FY22-23 Work Plan'!E61)","v":""},{"$f":"IF(ISBLANK('FY22-23 Work Plan'!F61),\"\",'FY22-23 Work Plan'!F61)","v":""},{"$f":"IF(ISBLANK('FY22-23 Work Plan'!H61),\"\",'FY22-23 Work Plan'!H61)","v":""},{"$f":"IF(ISBLANK('FY22-23 Work Plan'!I61),\"\",'FY22-23 Work Plan'!I61)","v":""},{"$f":"IF(ISBLANK('FY22-23 Work Plan'!J61),\"\",'FY22-23 Work Plan'!J61)","v":""},{"$f":"IF(ISBLANK('FY22-23 Work Plan'!K61),\"\",'FY22-23 Work Plan'!K61)","v":""},{"$f":"IF(ISBLANK('FY22-23 Work Plan'!L61),\"\",'FY22-23 Work Plan'!L61)","v":""}]
[{"$f":"IF(ISBLANK('FY22-23 Work Plan'!$E$2:$E$2),\"\",'FY22-23 Work Plan'!$E$2:$E$2)","v":"Asian American Drug Abuse Programs, Inc. (AADAP)"},{"$f":"IF(ISBLANK('FY22-23 Work Plan'!$J$2:$J$2),\"\",'FY22-23 Work Plan'!$J$2:$J$2)","v":"Prevention Education Program (PEP)"},{"$f":"IF(ISBLANK('FY22-23 Work Plan'!$J$3:$J$3),\"\",'FY22-23 Work Plan'!$J$3:$J$3)","v":""},{"$f":"IF(ISBLANK('FY22-23 Work Plan'!$E$3:$E$3),\"\",'FY22-23 Work Plan'!$E$3:$E$3)","v":"PH-004367"},{"$f":"IF(ISBLANK('FY22-23 Work Plan'!$E$4:$E$4),\"\",TEXT('FY22-23 Work Plan'!$E$4:$E$4,\"000000\"))","v":"000001"},{"$f":"IF(ISBLANK('FY22-23 Work Plan'!$J$4:$J$4),\"\",'FY22-23 Work Plan'!$J$4:$J$4)","v":"Building Skills"},{"$f":"IF(ISBLANK('FY22-23 Work Plan'!$E$5:$E$5),\"\",'FY22-23 Work Plan'!$E$5:$E$5)","v":"2 - San Fernando Valley"},{"$f":"IF(ISBLANK('FY22-23 Work Plan'!$J$5:$J$5),\"\",'FY22-23 Work Plan'!$J$5:$J$5)","v":"3rd District, 4th District"},{"$f":"IF(ISBLANK('FY22-23 Work Plan'!$E$6:$E$6),\"\",'FY22-23 Work Plan'!$E$6:$E$6)","v":"Angeles National Forest*, Artesia, Altadena*"},{"$f":"IF(ISBLANK('FY22-23 Work Plan'!$E$7:$E$7),\"\",'FY22-23 Work Plan'!$E$7:$E$7)","v":"Cadillac-Corning, Angeles National Forest"},{"$f":"IF(ISBLANK('FY22-23 Work Plan'!$E$8:$E$8),\"\",'FY22-23 Work Plan'!$E$8:$E$8)","v":"90032, 90036"},{"$f":"IF(ISBLANK('FY22-23 Work Plan'!$E$9:$E$9),\"\",'FY22-23 Work Plan'!$E$9:$E$9)","v":"123 E Main St., Suite 100 \nAnytown, CA 90000"},{"$f":"IF(ISBLANK('FY22-23 Work Plan'!$J$9:$J$9),\"\",TEXT('FY22-23 Work Plan'!$J$9:$J$9,\"###-###-####\"))","v":"999-999-9999"},{"$f":"IF(ISBLANK('FY22-23 Work Plan'!$J$10:$J$10),\"\",'FY22-23 Work Plan'!$J$10:$J$10)","v":"www.abc1.org"},{"$f":"IF(ISBLANK('FY22-23 Work Plan'!$E$11:$E$11),\"\",'FY22-23 Work Plan'!$E$11:$E$11)","v":"123 E Main St., Suite 100 \nAnytown, CA 90000"},{"$f":"IF(ISBLANK('FY22-23 Work Plan'!$J$11:$J$11),\"\",TEXT('FY22-23 Work Plan'!$J$11:$J$11,\"###-###-####\"))","v":"999-999-9999"},{"$f":"IF(ISBLANK('FY22-23 Work Plan'!$J$12:$J$12),\"\",'FY22-23 Work Plan'!$J$12:$J$12)","v":"www.abc2.org"},{"$f":"IF(ISBLANK('FY22-23 Work Plan'!$E$15:$E$15),\"\",'FY22-23 Work Plan'!$E$15:$E$15)","v":"John/Jane Doe"},{"$f":"IF(ISBLANK('FY22-23 Work Plan'!$H$15:$H$15),\"\",TEXT('FY22-23 Work Plan'!$H$15:$H$15,\"###-###-####\"))","v":"213-555-1212"},{"$f":"IF(ISBLANK('FY22-23 Work Plan'!$J$15:$J$15),\"\",'FY22-23 Work Plan'!$J$15:$J$15)","v":"janedoe@preventionusa.com"},{"$f":"IF(ISBLANK('FY22-23 Work Plan'!$E$16:$E$16),\"\",'FY22-23 Work Plan'!$E$16:$E$16)","v":"John/Jane Doe"},{"$f":"IF(ISBLANK('FY22-23 Work Plan'!$H$16:$H$16),\"\",TEXT('FY22-23 Work Plan'!$H$16:$H$16,\"###-###-####\"))","v":"213-555-1212"},{"$f":"IF(ISBLANK('FY22-23 Work Plan'!$J$16:$J$16),\"\",'FY22-23 Work Plan'!$J$16:$J$16)","v":"janedoe@preventionusa.com"},{"$f":"IF(ISBLANK('FY22-23 Work Plan'!$E$17:$E$17),\"\",'FY22-23 Work Plan'!$E$17:$E$17)","v":"John/Jane Doe"},{"$f":"IF(ISBLANK('FY22-23 Work Plan'!$H$17:$H$17),\"\",TEXT('FY22-23 Work Plan'!$H$17:$H$17,\"###-###-####\"))","v":"213-555-1212"},{"$f":"IF(ISBLANK('FY22-23 Work Plan'!$J$17:$J$17),\"\",'FY22-23 Work Plan'!$J$17:$J$17)","v":"j.doe@preventionusa.com"},{"$f":"IF(ISBLANK('FY22-23 Work Plan'!$E$18:$E$18),\"\",'FY22-23 Work Plan'!$E$18:$E$18)","v":"John/Jane Doe"},{"$f":"IF(ISBLANK('FY22-23 Work Plan'!$H$18:$H$18),\"\",TEXT('FY22-23 Work Plan'!$H$18:$H$18,\"###-###-####\"))","v":"213-555-1213"},{"$f":"IF(ISBLANK('FY22-23 Work Plan'!$J$18:$J$18),\"\",'FY22-23 Work Plan'!$J$18:$J$18)","v":"j.doe@preventionusa.com"},{"$f":"IF(ISBLANK('FY22-23 Work Plan'!$E$19:$E$19),\"\",'FY22-23 Work Plan'!$E$19:$E$19)","v":"John/Jane Doe"},{"$f":"IF(ISBLANK('FY22-23 Work Plan'!$H$19:$H$19),\"\",TEXT('FY22-23 Work Plan'!$H$19:$H$19,\"###-###-####\"))","v":"213-555-1213"},{"$f":"IF(ISBLANK('FY22-23 Work Plan'!$J$19:$J$19),\"\",'FY22-23 Work Plan'!$J$19:$J$19)","v":"j.doe@preventionusa.com"},{"$f":"IF(ISBLANK('FY22-23 Work Plan'!$D$23:$D$23),\"\",'FY22-23 Work Plan'!$D$23:$D$23)","v":""},{"$f":"IF(ISBLANK('FY22-23 Work Plan'!$H$23:$H$23),\"\",'FY22-23 Work Plan'!$H$23:$H$23)","v":""},{"$f":"IF(ISBLANK('FY22-23 Work Plan'!$D$24:$D$24),\"\",'FY22-23 Work Plan'!$D$24:$D$24)","v":""},{"$f":"IF(ISBLANK('FY22-23 Work Plan'!$H$24:$H$24),\"\",'FY22-23 Work Plan'!$H$24:$H$24)","v":""},{"$f":"IF(ISBLANK('FY22-23 Work Plan'!$D$25:$D$25),\"\",'FY22-23 Work Plan'!$D$25:$D$25)","v":""},{"$f":"IF(ISBLANK('FY22-23 Work Plan'!$H$25:$H$25),\"\",'FY22-23 Work Plan'!$H$25:$H$25)","v":""},{"$f":"IF(ISBLANK('FY22-23 Work Plan'!$D$26:$D$26),\"\",'FY22-23 Work Plan'!$D$26:$D$26)","v":""},{"$f":"IF(ISBLANK('FY22-23 Work Plan'!$H$26:$H$26),\"\",'FY22-23 Work Plan'!$H$26:$H$26)","v":""},{"$f":"IF(ISBLANK('FY22-23 Work Plan'!$D$27:$D$27),\"\",'FY22-23 Work Plan'!$D$27:$D$27)","v":""},{"$f":"IF(ISBLANK('FY22-23 Work Plan'!$H$27:$H$27),\"\",'FY22-23 Work Plan'!$H$27:$H$27)","v":""},{"$f":"IF(ISBLANK('FY22-23 Work Plan'!$D$28:$D$28),\"\",'FY22-23 Work Plan'!$D$28:$D$28)","v":""},{"$f":"IF(ISBLANK('FY22-23 Work Plan'!$H$28:$H$28),\"\",'FY22-23 Work Plan'!$H$28:$H$28)","v":""},{"$f":"IF(ISBLANK('FY22-23 Work Plan'!$D$29:$D$29),\"\",'FY22-23 Work Plan'!$D$29:$D$29)","v":""},{"$f":"IF(ISBLANK('FY22-23 Work Plan'!$H$29:$H$29),\"\",'FY22-23 Work Plan'!$H$29:$H$29)","v":""},{"$f":"IF(ISBLANK('FY22-23 Work Plan'!$B$30:$B$30),\"\",'FY22-23 Work Plan'!$B$30:$B$30)","v":""},{"$f":"IF(ISBLANK('FY22-23 Work Plan'!$D$30:$D$30),\"\",'FY22-23 Work Plan'!$D$30:$D$30)","v":""},{"$f":"IF(ISBLANK('FY22-23 Work Plan'!$H$30:$H$30),\"\",'FY22-23 Work Plan'!$H$30:$H$30)","v":""},{"$f":"IF(ISBLANK('FY22-23 Work Plan'!$B$31:$B$31),\"\",'FY22-23 Work Plan'!$B$31:$B$31)","v":""},{"$f":"IF(ISBLANK('FY22-23 Work Plan'!$D$31:$D$31),\"\",'FY22-23 Work Plan'!$D$31:$D$31)","v":""},{"$f":"IF(ISBLANK('FY22-23 Work Plan'!$H$31:$H$31),\"\",'FY22-23 Work Plan'!$H$31:$H$31)","v":""},{"$f":"IF(ISBLANK('FY22-23 Work Plan'!$B$32:$B$32),\"\",'FY22-23 Work Plan'!$B$32:$B$32)","v":""},{"$f":"IF(ISBLANK('FY22-23 Work Plan'!$D$32:$D$32),\"\",'FY22-23 Work Plan'!$D$32:$D$32)","v":""},{"$f":"IF(ISBLANK('FY22-23 Work Plan'!$H$32:$H$32),\"\",'FY22-23 Work Plan'!$H$32:$H$32)","v":""},{"$f":"IF(ISBLANK('FY22-23 Work Plan'!A62),\"\",'FY22-23 Work Plan'!A62)","v":""},{"$f":"IF(ISBLANK('FY22-23 Work Plan'!D62),\"\",'FY22-23 Work Plan'!D62)","v":""},{"$f":"IF(ISBLANK('FY22-23 Work Plan'!E62),\"\",'FY22-23 Work Plan'!E62)","v":""},{"$f":"IF(ISBLANK('FY22-23 Work Plan'!F62),\"\",'FY22-23 Work Plan'!F62)","v":""},{"$f":"IF(ISBLANK('FY22-23 Work Plan'!H62),\"\",'FY22-23 Work Plan'!H62)","v":""},{"$f":"IF(ISBLANK('FY22-23 Work Plan'!I62),\"\",'FY22-23 Work Plan'!I62)","v":""},{"$f":"IF(ISBLANK('FY22-23 Work Plan'!J62),\"\",'FY22-23 Work Plan'!J62)","v":""},{"$f":"IF(ISBLANK('FY22-23 Work Plan'!K62),\"\",'FY22-23 Work Plan'!K62)","v":""},{"$f":"IF(ISBLANK('FY22-23 Work Plan'!L62),\"\",'FY22-23 Work Plan'!L62)","v":""}]
[{"$f":"IF(ISBLANK('FY22-23 Work Plan'!$E$2:$E$2),\"\",'FY22-23 Work Plan'!$E$2:$E$2)","v":"Asian American Drug Abuse Programs, Inc. (AADAP)"},{"$f":"IF(ISBLANK('FY22-23 Work Plan'!$J$2:$J$2),\"\",'FY22-23 Work Plan'!$J$2:$J$2)","v":"Prevention Education Program (PEP)"},{"$f":"IF(ISBLANK('FY22-23 Work Plan'!$J$3:$J$3),\"\",'FY22-23 Work Plan'!$J$3:$J$3)","v":""},{"$f":"IF(ISBLANK('FY22-23 Work Plan'!$E$3:$E$3),\"\",'FY22-23 Work Plan'!$E$3:$E$3)","v":"PH-004367"},{"$f":"IF(ISBLANK('FY22-23 Work Plan'!$E$4:$E$4),\"\",TEXT('FY22-23 Work Plan'!$E$4:$E$4,\"000000\"))","v":"000001"},{"$f":"IF(ISBLANK('FY22-23 Work Plan'!$J$4:$J$4),\"\",'FY22-23 Work Plan'!$J$4:$J$4)","v":"Building Skills"},{"$f":"IF(ISBLANK('FY22-23 Work Plan'!$E$5:$E$5),\"\",'FY22-23 Work Plan'!$E$5:$E$5)","v":"2 - San Fernando Valley"},{"$f":"IF(ISBLANK('FY22-23 Work Plan'!$J$5:$J$5),\"\",'FY22-23 Work Plan'!$J$5:$J$5)","v":"3rd District, 4th District"},{"$f":"IF(ISBLANK('FY22-23 Work Plan'!$E$6:$E$6),\"\",'FY22-23 Work Plan'!$E$6:$E$6)","v":"Angeles National Forest*, Artesia, Altadena*"},{"$f":"IF(ISBLANK('FY22-23 Work Plan'!$E$7:$E$7),\"\",'FY22-23 Work Plan'!$E$7:$E$7)","v":"Cadillac-Corning, Angeles National Forest"},{"$f":"IF(ISBLANK('FY22-23 Work Plan'!$E$8:$E$8),\"\",'FY22-23 Work Plan'!$E$8:$E$8)","v":"90032, 90036"},{"$f":"IF(ISBLANK('FY22-23 Work Plan'!$E$9:$E$9),\"\",'FY22-23 Work Plan'!$E$9:$E$9)","v":"123 E Main St., Suite 100 \nAnytown, CA 90000"},{"$f":"IF(ISBLANK('FY22-23 Work Plan'!$J$9:$J$9),\"\",TEXT('FY22-23 Work Plan'!$J$9:$J$9,\"###-###-####\"))","v":"999-999-9999"},{"$f":"IF(ISBLANK('FY22-23 Work Plan'!$J$10:$J$10),\"\",'FY22-23 Work Plan'!$J$10:$J$10)","v":"www.abc1.org"},{"$f":"IF(ISBLANK('FY22-23 Work Plan'!$E$11:$E$11),\"\",'FY22-23 Work Plan'!$E$11:$E$11)","v":"123 E Main St., Suite 100 \nAnytown, CA 90000"},{"$f":"IF(ISBLANK('FY22-23 Work Plan'!$J$11:$J$11),\"\",TEXT('FY22-23 Work Plan'!$J$11:$J$11,\"###-###-####\"))","v":"999-999-9999"},{"$f":"IF(ISBLANK('FY22-23 Work Plan'!$J$12:$J$12),\"\",'FY22-23 Work Plan'!$J$12:$J$12)","v":"www.abc2.org"},{"$f":"IF(ISBLANK('FY22-23 Work Plan'!$E$15:$E$15),\"\",'FY22-23 Work Plan'!$E$15:$E$15)","v":"John/Jane Doe"},{"$f":"IF(ISBLANK('FY22-23 Work Plan'!$H$15:$H$15),\"\",TEXT('FY22-23 Work Plan'!$H$15:$H$15,\"###-###-####\"))","v":"213-555-1212"},{"$f":"IF(ISBLANK('FY22-23 Work Plan'!$J$15:$J$15),\"\",'FY22-23 Work Plan'!$J$15:$J$15)","v":"janedoe@preventionusa.com"},{"$f":"IF(ISBLANK('FY22-23 Work Plan'!$E$16:$E$16),\"\",'FY22-23 Work Plan'!$E$16:$E$16)","v":"John/Jane Doe"},{"$f":"IF(ISBLANK('FY22-23 Work Plan'!$H$16:$H$16),\"\",TEXT('FY22-23 Work Plan'!$H$16:$H$16,\"###-###-####\"))","v":"213-555-1212"},{"$f":"IF(ISBLANK('FY22-23 Work Plan'!$J$16:$J$16),\"\",'FY22-23 Work Plan'!$J$16:$J$16)","v":"janedoe@preventionusa.com"},{"$f":"IF(ISBLANK('FY22-23 Work Plan'!$E$17:$E$17),\"\",'FY22-23 Work Plan'!$E$17:$E$17)","v":"John/Jane Doe"},{"$f":"IF(ISBLANK('FY22-23 Work Plan'!$H$17:$H$17),\"\",TEXT('FY22-23 Work Plan'!$H$17:$H$17,\"###-###-####\"))","v":"213-555-1212"},{"$f":"IF(ISBLANK('FY22-23 Work Plan'!$J$17:$J$17),\"\",'FY22-23 Work Plan'!$J$17:$J$17)","v":"j.doe@preventionusa.com"},{"$f":"IF(ISBLANK('FY22-23 Work Plan'!$E$18:$E$18),\"\",'FY22-23 Work Plan'!$E$18:$E$18)","v":"John/Jane Doe"},{"$f":"IF(ISBLANK('FY22-23 Work Plan'!$H$18:$H$18),\"\",TEXT('FY22-23 Work Plan'!$H$18:$H$18,\"###-###-####\"))","v":"213-555-1213"},{"$f":"IF(ISBLANK('FY22-23 Work Plan'!$J$18:$J$18),\"\",'FY22-23 Work Plan'!$J$18:$J$18)","v":"j.doe@preventionusa.com"},{"$f":"IF(ISBLANK('FY22-23 Work Plan'!$E$19:$E$19),\"\",'FY22-23 Work Plan'!$E$19:$E$19)","v":"John/Jane Doe"},{"$f":"IF(ISBLANK('FY22-23 Work Plan'!$H$19:$H$19),\"\",TEXT('FY22-23 Work Plan'!$H$19:$H$19,\"###-###-####\"))","v":"213-555-1213"},{"$f":"IF(ISBLANK('FY22-23 Work Plan'!$J$19:$J$19),\"\",'FY22-23 Work Plan'!$J$19:$J$19)","v":"j.doe@preventionusa.com"},{"$f":"IF(ISBLANK('FY22-23 Work Plan'!$D$23:$D$23),\"\",'FY22-23 Work Plan'!$D$23:$D$23)","v":""},{"$f":"IF(ISBLANK('FY22-23 Work Plan'!$H$23:$H$23),\"\",'FY22-23 Work Plan'!$H$23:$H$23)","v":""},{"$f":"IF(ISBLANK('FY22-23 Work Plan'!$D$24:$D$24),\"\",'FY22-23 Work Plan'!$D$24:$D$24)","v":""},{"$f":"IF(ISBLANK('FY22-23 Work Plan'!$H$24:$H$24),\"\",'FY22-23 Work Plan'!$H$24:$H$24)","v":""},{"$f":"IF(ISBLANK('FY22-23 Work Plan'!$D$25:$D$25),\"\",'FY22-23 Work Plan'!$D$25:$D$25)","v":""},{"$f":"IF(ISBLANK('FY22-23 Work Plan'!$H$25:$H$25),\"\",'FY22-23 Work Plan'!$H$25:$H$25)","v":""},{"$f":"IF(ISBLANK('FY22-23 Work Plan'!$D$26:$D$26),\"\",'FY22-23 Work Plan'!$D$26:$D$26)","v":""},{"$f":"IF(ISBLANK('FY22-23 Work Plan'!$H$26:$H$26),\"\",'FY22-23 Work Plan'!$H$26:$H$26)","v":""},{"$f":"IF(ISBLANK('FY22-23 Work Plan'!$D$27:$D$27),\"\",'FY22-23 Work Plan'!$D$27:$D$27)","v":""},{"$f":"IF(ISBLANK('FY22-23 Work Plan'!$H$27:$H$27),\"\",'FY22-23 Work Plan'!$H$27:$H$27)","v":""},{"$f":"IF(ISBLANK('FY22-23 Work Plan'!$D$28:$D$28),\"\",'FY22-23 Work Plan'!$D$28:$D$28)","v":""},{"$f":"IF(ISBLANK('FY22-23 Work Plan'!$H$28:$H$28),\"\",'FY22-23 Work Plan'!$H$28:$H$28)","v":""},{"$f":"IF(ISBLANK('FY22-23 Work Plan'!$D$29:$D$29),\"\",'FY22-23 Work Plan'!$D$29:$D$29)","v":""},{"$f":"IF(ISBLANK('FY22-23 Work Plan'!$H$29:$H$29),\"\",'FY22-23 Work Plan'!$H$29:$H$29)","v":""},{"$f":"IF(ISBLANK('FY22-23 Work Plan'!$B$30:$B$30),\"\",'FY22-23 Work Plan'!$B$30:$B$30)","v":""},{"$f":"IF(ISBLANK('FY22-23 Work Plan'!$D$30:$D$30),\"\",'FY22-23 Work Plan'!$D$30:$D$30)","v":""},{"$f":"IF(ISBLANK('FY22-23 Work Plan'!$H$30:$H$30),\"\",'FY22-23 Work Plan'!$H$30:$H$30)","v":""},{"$f":"IF(ISBLANK('FY22-23 Work Plan'!$B$31:$B$31),\"\",'FY22-23 Work Plan'!$B$31:$B$31)","v":""},{"$f":"IF(ISBLANK('FY22-23 Work Plan'!$D$31:$D$31),\"\",'FY22-23 Work Plan'!$D$31:$D$31)","v":""},{"$f":"IF(ISBLANK('FY22-23 Work Plan'!$H$31:$H$31),\"\",'FY22-23 Work Plan'!$H$31:$H$31)","v":""},{"$f":"IF(ISBLANK('FY22-23 Work Plan'!$B$32:$B$32),\"\",'FY22-23 Work Plan'!$B$32:$B$32)","v":""},{"$f":"IF(ISBLANK('FY22-23 Work Plan'!$D$32:$D$32),\"\",'FY22-23 Work Plan'!$D$32:$D$32)","v":""},{"$f":"IF(ISBLANK('FY22-23 Work Plan'!$H$32:$H$32),\"\",'FY22-23 Work Plan'!$H$32:$H$32)","v":""},{"$f":"IF(ISBLANK('FY22-23 Work Plan'!A63),\"\",'FY22-23 Work Plan'!A63)","v":""},{"$f":"IF(ISBLANK('FY22-23 Work Plan'!D63),\"\",'FY22-23 Work Plan'!D63)","v":""},{"$f":"IF(ISBLANK('FY22-23 Work Plan'!E63),\"\",'FY22-23 Work Plan'!E63)","v":""},{"$f":"IF(ISBLANK('FY22-23 Work Plan'!F63),\"\",'FY22-23 Work Plan'!F63)","v":""},{"$f":"IF(ISBLANK('FY22-23 Work Plan'!H63),\"\",'FY22-23 Work Plan'!H63)","v":""},{"$f":"IF(ISBLANK('FY22-23 Work Plan'!I63),\"\",'FY22-23 Work Plan'!I63)","v":""},{"$f":"IF(ISBLANK('FY22-23 Work Plan'!J63),\"\",'FY22-23 Work Plan'!J63)","v":""},{"$f":"IF(ISBLANK('FY22-23 Work Plan'!K63),\"\",'FY22-23 Work Plan'!K63)","v":""},{"$f":"IF(ISBLANK('FY22-23 Work Plan'!L63),\"\",'FY22-23 Work Plan'!L63)","v":""}]
[{"$f":"IF(ISBLANK('FY22-23 Work Plan'!$E$2:$E$2),\"\",'FY22-23 Work Plan'!$E$2:$E$2)","v":"Asian American Drug Abuse Programs, Inc. (AADAP)"},{"$f":"IF(ISBLANK('FY22-23 Work Plan'!$J$2:$J$2),\"\",'FY22-23 Work Plan'!$J$2:$J$2)","v":"Prevention Education Program (PEP)"},{"$f":"IF(ISBLANK('FY22-23 Work Plan'!$J$3:$J$3),\"\",'FY22-23 Work Plan'!$J$3:$J$3)","v":""},{"$f":"IF(ISBLANK('FY22-23 Work Plan'!$E$3:$E$3),\"\",'FY22-23 Work Plan'!$E$3:$E$3)","v":"PH-004367"},{"$f":"IF(ISBLANK('FY22-23 Work Plan'!$E$4:$E$4),\"\",TEXT('FY22-23 Work Plan'!$E$4:$E$4,\"000000\"))","v":"000001"},{"$f":"IF(ISBLANK('FY22-23 Work Plan'!$J$4:$J$4),\"\",'FY22-23 Work Plan'!$J$4:$J$4)","v":"Building Skills"},{"$f":"IF(ISBLANK('FY22-23 Work Plan'!$E$5:$E$5),\"\",'FY22-23 Work Plan'!$E$5:$E$5)","v":"2 - San Fernando Valley"},{"$f":"IF(ISBLANK('FY22-23 Work Plan'!$J$5:$J$5),\"\",'FY22-23 Work Plan'!$J$5:$J$5)","v":"3rd District, 4th District"},{"$f":"IF(ISBLANK('FY22-23 Work Plan'!$E$6:$E$6),\"\",'FY22-23 Work Plan'!$E$6:$E$6)","v":"Angeles National Forest*, Artesia, Altadena*"},{"$f":"IF(ISBLANK('FY22-23 Work Plan'!$E$7:$E$7),\"\",'FY22-23 Work Plan'!$E$7:$E$7)","v":"Cadillac-Corning, Angeles National Forest"},{"$f":"IF(ISBLANK('FY22-23 Work Plan'!$E$8:$E$8),\"\",'FY22-23 Work Plan'!$E$8:$E$8)","v":"90032, 90036"},{"$f":"IF(ISBLANK('FY22-23 Work Plan'!$E$9:$E$9),\"\",'FY22-23 Work Plan'!$E$9:$E$9)","v":"123 E Main St., Suite 100 \nAnytown, CA 90000"},{"$f":"IF(ISBLANK('FY22-23 Work Plan'!$J$9:$J$9),\"\",TEXT('FY22-23 Work Plan'!$J$9:$J$9,\"###-###-####\"))","v":"999-999-9999"},{"$f":"IF(ISBLANK('FY22-23 Work Plan'!$J$10:$J$10),\"\",'FY22-23 Work Plan'!$J$10:$J$10)","v":"www.abc1.org"},{"$f":"IF(ISBLANK('FY22-23 Work Plan'!$E$11:$E$11),\"\",'FY22-23 Work Plan'!$E$11:$E$11)","v":"123 E Main St., Suite 100 \nAnytown, CA 90000"},{"$f":"IF(ISBLANK('FY22-23 Work Plan'!$J$11:$J$11),\"\",TEXT('FY22-23 Work Plan'!$J$11:$J$11,\"###-###-####\"))","v":"999-999-9999"},{"$f":"IF(ISBLANK('FY22-23 Work Plan'!$J$12:$J$12),\"\",'FY22-23 Work Plan'!$J$12:$J$12)","v":"www.abc2.org"},{"$f":"IF(ISBLANK('FY22-23 Work Plan'!$E$15:$E$15),\"\",'FY22-23 Work Plan'!$E$15:$E$15)","v":"John/Jane Doe"},{"$f":"IF(ISBLANK('FY22-23 Work Plan'!$H$15:$H$15),\"\",TEXT('FY22-23 Work Plan'!$H$15:$H$15,\"###-###-####\"))","v":"213-555-1212"},{"$f":"IF(ISBLANK('FY22-23 Work Plan'!$J$15:$J$15),\"\",'FY22-23 Work Plan'!$J$15:$J$15)","v":"janedoe@preventionusa.com"},{"$f":"IF(ISBLANK('FY22-23 Work Plan'!$E$16:$E$16),\"\",'FY22-23 Work Plan'!$E$16:$E$16)","v":"John/Jane Doe"},{"$f":"IF(ISBLANK('FY22-23 Work Plan'!$H$16:$H$16),\"\",TEXT('FY22-23 Work Plan'!$H$16:$H$16,\"###-###-####\"))","v":"213-555-1212"},{"$f":"IF(ISBLANK('FY22-23 Work Plan'!$J$16:$J$16),\"\",'FY22-23 Work Plan'!$J$16:$J$16)","v":"janedoe@preventionusa.com"},{"$f":"IF(ISBLANK('FY22-23 Work Plan'!$E$17:$E$17),\"\",'FY22-23 Work Plan'!$E$17:$E$17)","v":"John/Jane Doe"},{"$f":"IF(ISBLANK('FY22-23 Work Plan'!$H$17:$H$17),\"\",TEXT('FY22-23 Work Plan'!$H$17:$H$17,\"###-###-####\"))","v":"213-555-1212"},{"$f":"IF(ISBLANK('FY22-23 Work Plan'!$J$17:$J$17),\"\",'FY22-23 Work Plan'!$J$17:$J$17)","v":"j.doe@preventionusa.com"},{"$f":"IF(ISBLANK('FY22-23 Work Plan'!$E$18:$E$18),\"\",'FY22-23 Work Plan'!$E$18:$E$18)","v":"John/Jane Doe"},{"$f":"IF(ISBLANK('FY22-23 Work Plan'!$H$18:$H$18),\"\",TEXT('FY22-23 Work Plan'!$H$18:$H$18,\"###-###-####\"))","v":"213-555-1213"},{"$f":"IF(ISBLANK('FY22-23 Work Plan'!$J$18:$J$18),\"\",'FY22-23 Work Plan'!$J$18:$J$18)","v":"j.doe@preventionusa.com"},{"$f":"IF(ISBLANK('FY22-23 Work Plan'!$E$19:$E$19),\"\",'FY22-23 Work Plan'!$E$19:$E$19)","v":"John/Jane Doe"},{"$f":"IF(ISBLANK('FY22-23 Work Plan'!$H$19:$H$19),\"\",TEXT('FY22-23 Work Plan'!$H$19:$H$19,\"###-###-####\"))","v":"213-555-1213"},{"$f":"IF(ISBLANK('FY22-23 Work Plan'!$J$19:$J$19),\"\",'FY22-23 Work Plan'!$J$19:$J$19)","v":"j.doe@preventionusa.com"},{"$f":"IF(ISBLANK('FY22-23 Work Plan'!$D$23:$D$23),\"\",'FY22-23 Work Plan'!$D$23:$D$23)","v":""},{"$f":"IF(ISBLANK('FY22-23 Work Plan'!$H$23:$H$23),\"\",'FY22-23 Work Plan'!$H$23:$H$23)","v":""},{"$f":"IF(ISBLANK('FY22-23 Work Plan'!$D$24:$D$24),\"\",'FY22-23 Work Plan'!$D$24:$D$24)","v":""},{"$f":"IF(ISBLANK('FY22-23 Work Plan'!$H$24:$H$24),\"\",'FY22-23 Work Plan'!$H$24:$H$24)","v":""},{"$f":"IF(ISBLANK('FY22-23 Work Plan'!$D$25:$D$25),\"\",'FY22-23 Work Plan'!$D$25:$D$25)","v":""},{"$f":"IF(ISBLANK('FY22-23 Work Plan'!$H$25:$H$25),\"\",'FY22-23 Work Plan'!$H$25:$H$25)","v":""},{"$f":"IF(ISBLANK('FY22-23 Work Plan'!$D$26:$D$26),\"\",'FY22-23 Work Plan'!$D$26:$D$26)","v":""},{"$f":"IF(ISBLANK('FY22-23 Work Plan'!$H$26:$H$26),\"\",'FY22-23 Work Plan'!$H$26:$H$26)","v":""},{"$f":"IF(ISBLANK('FY22-23 Work Plan'!$D$27:$D$27),\"\",'FY22-23 Work Plan'!$D$27:$D$27)","v":""},{"$f":"IF(ISBLANK('FY22-23 Work Plan'!$H$27:$H$27),\"\",'FY22-23 Work Plan'!$H$27:$H$27)","v":""},{"$f":"IF(ISBLANK('FY22-23 Work Plan'!$D$28:$D$28),\"\",'FY22-23 Work Plan'!$D$28:$D$28)","v":""},{"$f":"IF(ISBLANK('FY22-23 Work Plan'!$H$28:$H$28),\"\",'FY22-23 Work Plan'!$H$28:$H$28)","v":""},{"$f":"IF(ISBLANK('FY22-23 Work Plan'!$D$29:$D$29),\"\",'FY22-23 Work Plan'!$D$29:$D$29)","v":""},{"$f":"IF(ISBLANK('FY22-23 Work Plan'!$H$29:$H$29),\"\",'FY22-23 Work Plan'!$H$29:$H$29)","v":""},{"$f":"IF(ISBLANK('FY22-23 Work Plan'!$B$30:$B$30),\"\",'FY22-23 Work Plan'!$B$30:$B$30)","v":""},{"$f":"IF(ISBLANK('FY22-23 Work Plan'!$D$30:$D$30),\"\",'FY22-23 Work Plan'!$D$30:$D$30)","v":""},{"$f":"IF(ISBLANK('FY22-23 Work Plan'!$H$30:$H$30),\"\",'FY22-23 Work Plan'!$H$30:$H$30)","v":""},{"$f":"IF(ISBLANK('FY22-23 Work Plan'!$B$31:$B$31),\"\",'FY22-23 Work Plan'!$B$31:$B$31)","v":""},{"$f":"IF(ISBLANK('FY22-23 Work Plan'!$D$31:$D$31),\"\",'FY22-23 Work Plan'!$D$31:$D$31)","v":""},{"$f":"IF(ISBLANK('FY22-23 Work Plan'!$H$31:$H$31),\"\",'FY22-23 Work Plan'!$H$31:$H$31)","v":""},{"$f":"IF(ISBLANK('FY22-23 Work Plan'!$B$32:$B$32),\"\",'FY22-23 Work Plan'!$B$32:$B$32)","v":""},{"$f":"IF(ISBLANK('FY22-23 Work Plan'!$D$32:$D$32),\"\",'FY22-23 Work Plan'!$D$32:$D$32)","v":""},{"$f":"IF(ISBLANK('FY22-23 Work Plan'!$H$32:$H$32),\"\",'FY22-23 Work Plan'!$H$32:$H$32)","v":""},{"$f":"IF(ISBLANK('FY22-23 Work Plan'!A64),\"\",'FY22-23 Work Plan'!A64)","v":""},{"$f":"IF(ISBLANK('FY22-23 Work Plan'!D64),\"\",'FY22-23 Work Plan'!D64)","v":""},{"$f":"IF(ISBLANK('FY22-23 Work Plan'!E64),\"\",'FY22-23 Work Plan'!E64)","v":""},{"$f":"IF(ISBLANK('FY22-23 Work Plan'!F64),\"\",'FY22-23 Work Plan'!F64)","v":""},{"$f":"IF(ISBLANK('FY22-23 Work Plan'!H64),\"\",'FY22-23 Work Plan'!H64)","v":""},{"$f":"IF(ISBLANK('FY22-23 Work Plan'!I64),\"\",'FY22-23 Work Plan'!I64)","v":""},{"$f":"IF(ISBLANK('FY22-23 Work Plan'!J64),\"\",'FY22-23 Work Plan'!J64)","v":""},{"$f":"IF(ISBLANK('FY22-23 Work Plan'!K64),\"\",'FY22-23 Work Plan'!K64)","v":""},{"$f":"IF(ISBLANK('FY22-23 Work Plan'!L64),\"\",'FY22-23 Work Plan'!L64)","v":""}]
[{"$f":"IF(ISBLANK('FY22-23 Work Plan'!$E$2:$E$2),\"\",'FY22-23 Work Plan'!$E$2:$E$2)","v":"Asian American Drug Abuse Programs, Inc. (AADAP)"},{"$f":"IF(ISBLANK('FY22-23 Work Plan'!$J$2:$J$2),\"\",'FY22-23 Work Plan'!$J$2:$J$2)","v":"Prevention Education Program (PEP)"},{"$f":"IF(ISBLANK('FY22-23 Work Plan'!$J$3:$J$3),\"\",'FY22-23 Work Plan'!$J$3:$J$3)","v":""},{"$f":"IF(ISBLANK('FY22-23 Work Plan'!$E$3:$E$3),\"\",'FY22-23 Work Plan'!$E$3:$E$3)","v":"PH-004367"},{"$f":"IF(ISBLANK('FY22-23 Work Plan'!$E$4:$E$4),\"\",TEXT('FY22-23 Work Plan'!$E$4:$E$4,\"000000\"))","v":"000001"},{"$f":"IF(ISBLANK('FY22-23 Work Plan'!$J$4:$J$4),\"\",'FY22-23 Work Plan'!$J$4:$J$4)","v":"Building Skills"},{"$f":"IF(ISBLANK('FY22-23 Work Plan'!$E$5:$E$5),\"\",'FY22-23 Work Plan'!$E$5:$E$5)","v":"2 - San Fernando Valley"},{"$f":"IF(ISBLANK('FY22-23 Work Plan'!$J$5:$J$5),\"\",'FY22-23 Work Plan'!$J$5:$J$5)","v":"3rd District, 4th District"},{"$f":"IF(ISBLANK('FY22-23 Work Plan'!$E$6:$E$6),\"\",'FY22-23 Work Plan'!$E$6:$E$6)","v":"Angeles National Forest*, Artesia, Altadena*"},{"$f":"IF(ISBLANK('FY22-23 Work Plan'!$E$7:$E$7),\"\",'FY22-23 Work Plan'!$E$7:$E$7)","v":"Cadillac-Corning, Angeles National Forest"},{"$f":"IF(ISBLANK('FY22-23 Work Plan'!$E$8:$E$8),\"\",'FY22-23 Work Plan'!$E$8:$E$8)","v":"90032, 90036"},{"$f":"IF(ISBLANK('FY22-23 Work Plan'!$E$9:$E$9),\"\",'FY22-23 Work Plan'!$E$9:$E$9)","v":"123 E Main St., Suite 100 \nAnytown, CA 90000"},{"$f":"IF(ISBLANK('FY22-23 Work Plan'!$J$9:$J$9),\"\",TEXT('FY22-23 Work Plan'!$J$9:$J$9,\"###-###-####\"))","v":"999-999-9999"},{"$f":"IF(ISBLANK('FY22-23 Work Plan'!$J$10:$J$10),\"\",'FY22-23 Work Plan'!$J$10:$J$10)","v":"www.abc1.org"},{"$f":"IF(ISBLANK('FY22-23 Work Plan'!$E$11:$E$11),\"\",'FY22-23 Work Plan'!$E$11:$E$11)","v":"123 E Main St., Suite 100 \nAnytown, CA 90000"},{"$f":"IF(ISBLANK('FY22-23 Work Plan'!$J$11:$J$11),\"\",TEXT('FY22-23 Work Plan'!$J$11:$J$11,\"###-###-####\"))","v":"999-999-9999"},{"$f":"IF(ISBLANK('FY22-23 Work Plan'!$J$12:$J$12),\"\",'FY22-23 Work Plan'!$J$12:$J$12)","v":"www.abc2.org"},{"$f":"IF(ISBLANK('FY22-23 Work Plan'!$E$15:$E$15),\"\",'FY22-23 Work Plan'!$E$15:$E$15)","v":"John/Jane Doe"},{"$f":"IF(ISBLANK('FY22-23 Work Plan'!$H$15:$H$15),\"\",TEXT('FY22-23 Work Plan'!$H$15:$H$15,\"###-###-####\"))","v":"213-555-1212"},{"$f":"IF(ISBLANK('FY22-23 Work Plan'!$J$15:$J$15),\"\",'FY22-23 Work Plan'!$J$15:$J$15)","v":"janedoe@preventionusa.com"},{"$f":"IF(ISBLANK('FY22-23 Work Plan'!$E$16:$E$16),\"\",'FY22-23 Work Plan'!$E$16:$E$16)","v":"John/Jane Doe"},{"$f":"IF(ISBLANK('FY22-23 Work Plan'!$H$16:$H$16),\"\",TEXT('FY22-23 Work Plan'!$H$16:$H$16,\"###-###-####\"))","v":"213-555-1212"},{"$f":"IF(ISBLANK('FY22-23 Work Plan'!$J$16:$J$16),\"\",'FY22-23 Work Plan'!$J$16:$J$16)","v":"janedoe@preventionusa.com"},{"$f":"IF(ISBLANK('FY22-23 Work Plan'!$E$17:$E$17),\"\",'FY22-23 Work Plan'!$E$17:$E$17)","v":"John/Jane Doe"},{"$f":"IF(ISBLANK('FY22-23 Work Plan'!$H$17:$H$17),\"\",TEXT('FY22-23 Work Plan'!$H$17:$H$17,\"###-###-####\"))","v":"213-555-1212"},{"$f":"IF(ISBLANK('FY22-23 Work Plan'!$J$17:$J$17),\"\",'FY22-23 Work Plan'!$J$17:$J$17)","v":"j.doe@preventionusa.com"},{"$f":"IF(ISBLANK('FY22-23 Work Plan'!$E$18:$E$18),\"\",'FY22-23 Work Plan'!$E$18:$E$18)","v":"John/Jane Doe"},{"$f":"IF(ISBLANK('FY22-23 Work Plan'!$H$18:$H$18),\"\",TEXT('FY22-23 Work Plan'!$H$18:$H$18,\"###-###-####\"))","v":"213-555-1213"},{"$f":"IF(ISBLANK('FY22-23 Work Plan'!$J$18:$J$18),\"\",'FY22-23 Work Plan'!$J$18:$J$18)","v":"j.doe@preventionusa.com"},{"$f":"IF(ISBLANK('FY22-23 Work Plan'!$E$19:$E$19),\"\",'FY22-23 Work Plan'!$E$19:$E$19)","v":"John/Jane Doe"},{"$f":"IF(ISBLANK('FY22-23 Work Plan'!$H$19:$H$19),\"\",TEXT('FY22-23 Work Plan'!$H$19:$H$19,\"###-###-####\"))","v":"213-555-1213"},{"$f":"IF(ISBLANK('FY22-23 Work Plan'!$J$19:$J$19),\"\",'FY22-23 Work Plan'!$J$19:$J$19)","v":"j.doe@preventionusa.com"},{"$f":"IF(ISBLANK('FY22-23 Work Plan'!$D$23:$D$23),\"\",'FY22-23 Work Plan'!$D$23:$D$23)","v":""},{"$f":"IF(ISBLANK('FY22-23 Work Plan'!$H$23:$H$23),\"\",'FY22-23 Work Plan'!$H$23:$H$23)","v":""},{"$f":"IF(ISBLANK('FY22-23 Work Plan'!$D$24:$D$24),\"\",'FY22-23 Work Plan'!$D$24:$D$24)","v":""},{"$f":"IF(ISBLANK('FY22-23 Work Plan'!$H$24:$H$24),\"\",'FY22-23 Work Plan'!$H$24:$H$24)","v":""},{"$f":"IF(ISBLANK('FY22-23 Work Plan'!$D$25:$D$25),\"\",'FY22-23 Work Plan'!$D$25:$D$25)","v":""},{"$f":"IF(ISBLANK('FY22-23 Work Plan'!$H$25:$H$25),\"\",'FY22-23 Work Plan'!$H$25:$H$25)","v":""},{"$f":"IF(ISBLANK('FY22-23 Work Plan'!$D$26:$D$26),\"\",'FY22-23 Work Plan'!$D$26:$D$26)","v":""},{"$f":"IF(ISBLANK('FY22-23 Work Plan'!$H$26:$H$26),\"\",'FY22-23 Work Plan'!$H$26:$H$26)","v":""},{"$f":"IF(ISBLANK('FY22-23 Work Plan'!$D$27:$D$27),\"\",'FY22-23 Work Plan'!$D$27:$D$27)","v":""},{"$f":"IF(ISBLANK('FY22-23 Work Plan'!$H$27:$H$27),\"\",'FY22-23 Work Plan'!$H$27:$H$27)","v":""},{"$f":"IF(ISBLANK('FY22-23 Work Plan'!$D$28:$D$28),\"\",'FY22-23 Work Plan'!$D$28:$D$28)","v":""},{"$f":"IF(ISBLANK('FY22-23 Work Plan'!$H$28:$H$28),\"\",'FY22-23 Work Plan'!$H$28:$H$28)","v":""},{"$f":"IF(ISBLANK('FY22-23 Work Plan'!$D$29:$D$29),\"\",'FY22-23 Work Plan'!$D$29:$D$29)","v":""},{"$f":"IF(ISBLANK('FY22-23 Work Plan'!$H$29:$H$29),\"\",'FY22-23 Work Plan'!$H$29:$H$29)","v":""},{"$f":"IF(ISBLANK('FY22-23 Work Plan'!$B$30:$B$30),\"\",'FY22-23 Work Plan'!$B$30:$B$30)","v":""},{"$f":"IF(ISBLANK('FY22-23 Work Plan'!$D$30:$D$30),\"\",'FY22-23 Work Plan'!$D$30:$D$30)","v":""},{"$f":"IF(ISBLANK('FY22-23 Work Plan'!$H$30:$H$30),\"\",'FY22-23 Work Plan'!$H$30:$H$30)","v":""},{"$f":"IF(ISBLANK('FY22-23 Work Plan'!$B$31:$B$31),\"\",'FY22-23 Work Plan'!$B$31:$B$31)","v":""},{"$f":"IF(ISBLANK('FY22-23 Work Plan'!$D$31:$D$31),\"\",'FY22-23 Work Plan'!$D$31:$D$31)","v":""},{"$f":"IF(ISBLANK('FY22-23 Work Plan'!$H$31:$H$31),\"\",'FY22-23 Work Plan'!$H$31:$H$31)","v":""},{"$f":"IF(ISBLANK('FY22-23 Work Plan'!$B$32:$B$32),\"\",'FY22-23 Work Plan'!$B$32:$B$32)","v":""},{"$f":"IF(ISBLANK('FY22-23 Work Plan'!$D$32:$D$32),\"\",'FY22-23 Work Plan'!$D$32:$D$32)","v":""},{"$f":"IF(ISBLANK('FY22-23 Work Plan'!$H$32:$H$32),\"\",'FY22-23 Work Plan'!$H$32:$H$32)","v":""},{"$f":"IF(ISBLANK('FY22-23 Work Plan'!A65),\"\",'FY22-23 Work Plan'!A65)","v":""},{"$f":"IF(ISBLANK('FY22-23 Work Plan'!D65),\"\",'FY22-23 Work Plan'!D65)","v":""},{"$f":"IF(ISBLANK('FY22-23 Work Plan'!E65),\"\",'FY22-23 Work Plan'!E65)","v":""},{"$f":"IF(ISBLANK('FY22-23 Work Plan'!F65),\"\",'FY22-23 Work Plan'!F65)","v":""},{"$f":"IF(ISBLANK('FY22-23 Work Plan'!H65),\"\",'FY22-23 Work Plan'!H65)","v":""},{"$f":"IF(ISBLANK('FY22-23 Work Plan'!I65),\"\",'FY22-23 Work Plan'!I65)","v":""},{"$f":"IF(ISBLANK('FY22-23 Work Plan'!J65),\"\",'FY22-23 Work Plan'!J65)","v":""},{"$f":"IF(ISBLANK('FY22-23 Work Plan'!K65),\"\",'FY22-23 Work Plan'!K65)","v":""},{"$f":"IF(ISBLANK('FY22-23 Work Plan'!L65),\"\",'FY22-23 Work Plan'!L65)","v":""}]
[{"$f":"IF(ISBLANK('FY22-23 Work Plan'!$E$2:$E$2),\"\",'FY22-23 Work Plan'!$E$2:$E$2)","v":"Asian American Drug Abuse Programs, Inc. (AADAP)"},{"$f":"IF(ISBLANK('FY22-23 Work Plan'!$J$2:$J$2),\"\",'FY22-23 Work Plan'!$J$2:$J$2)","v":"Prevention Education Program (PEP)"},{"$f":"IF(ISBLANK('FY22-23 Work Plan'!$J$3:$J$3),\"\",'FY22-23 Work Plan'!$J$3:$J$3)","v":""},{"$f":"IF(ISBLANK('FY22-23 Work Plan'!$E$3:$E$3),\"\",'FY22-23 Work Plan'!$E$3:$E$3)","v":"PH-004367"},{"$f":"IF(ISBLANK('FY22-23 Work Plan'!$E$4:$E$4),\"\",TEXT('FY22-23 Work Plan'!$E$4:$E$4,\"000000\"))","v":"000001"},{"$f":"IF(ISBLANK('FY22-23 Work Plan'!$J$4:$J$4),\"\",'FY22-23 Work Plan'!$J$4:$J$4)","v":"Building Skills"},{"$f":"IF(ISBLANK('FY22-23 Work Plan'!$E$5:$E$5),\"\",'FY22-23 Work Plan'!$E$5:$E$5)","v":"2 - San Fernando Valley"},{"$f":"IF(ISBLANK('FY22-23 Work Plan'!$J$5:$J$5),\"\",'FY22-23 Work Plan'!$J$5:$J$5)","v":"3rd District, 4th District"},{"$f":"IF(ISBLANK('FY22-23 Work Plan'!$E$6:$E$6),\"\",'FY22-23 Work Plan'!$E$6:$E$6)","v":"Angeles National Forest*, Artesia, Altadena*"},{"$f":"IF(ISBLANK('FY22-23 Work Plan'!$E$7:$E$7),\"\",'FY22-23 Work Plan'!$E$7:$E$7)","v":"Cadillac-Corning, Angeles National Forest"},{"$f":"IF(ISBLANK('FY22-23 Work Plan'!$E$8:$E$8),\"\",'FY22-23 Work Plan'!$E$8:$E$8)","v":"90032, 90036"},{"$f":"IF(ISBLANK('FY22-23 Work Plan'!$E$9:$E$9),\"\",'FY22-23 Work Plan'!$E$9:$E$9)","v":"123 E Main St., Suite 100 \nAnytown, CA 90000"},{"$f":"IF(ISBLANK('FY22-23 Work Plan'!$J$9:$J$9),\"\",TEXT('FY22-23 Work Plan'!$J$9:$J$9,\"###-###-####\"))","v":"999-999-9999"},{"$f":"IF(ISBLANK('FY22-23 Work Plan'!$J$10:$J$10),\"\",'FY22-23 Work Plan'!$J$10:$J$10)","v":"www.abc1.org"},{"$f":"IF(ISBLANK('FY22-23 Work Plan'!$E$11:$E$11),\"\",'FY22-23 Work Plan'!$E$11:$E$11)","v":"123 E Main St., Suite 100 \nAnytown, CA 90000"},{"$f":"IF(ISBLANK('FY22-23 Work Plan'!$J$11:$J$11),\"\",TEXT('FY22-23 Work Plan'!$J$11:$J$11,\"###-###-####\"))","v":"999-999-9999"},{"$f":"IF(ISBLANK('FY22-23 Work Plan'!$J$12:$J$12),\"\",'FY22-23 Work Plan'!$J$12:$J$12)","v":"www.abc2.org"},{"$f":"IF(ISBLANK('FY22-23 Work Plan'!$E$15:$E$15),\"\",'FY22-23 Work Plan'!$E$15:$E$15)","v":"John/Jane Doe"},{"$f":"IF(ISBLANK('FY22-23 Work Plan'!$H$15:$H$15),\"\",TEXT('FY22-23 Work Plan'!$H$15:$H$15,\"###-###-####\"))","v":"213-555-1212"},{"$f":"IF(ISBLANK('FY22-23 Work Plan'!$J$15:$J$15),\"\",'FY22-23 Work Plan'!$J$15:$J$15)","v":"janedoe@preventionusa.com"},{"$f":"IF(ISBLANK('FY22-23 Work Plan'!$E$16:$E$16),\"\",'FY22-23 Work Plan'!$E$16:$E$16)","v":"John/Jane Doe"},{"$f":"IF(ISBLANK('FY22-23 Work Plan'!$H$16:$H$16),\"\",TEXT('FY22-23 Work Plan'!$H$16:$H$16,\"###-###-####\"))","v":"213-555-1212"},{"$f":"IF(ISBLANK('FY22-23 Work Plan'!$J$16:$J$16),\"\",'FY22-23 Work Plan'!$J$16:$J$16)","v":"janedoe@preventionusa.com"},{"$f":"IF(ISBLANK('FY22-23 Work Plan'!$E$17:$E$17),\"\",'FY22-23 Work Plan'!$E$17:$E$17)","v":"John/Jane Doe"},{"$f":"IF(ISBLANK('FY22-23 Work Plan'!$H$17:$H$17),\"\",TEXT('FY22-23 Work Plan'!$H$17:$H$17,\"###-###-####\"))","v":"213-555-1212"},{"$f":"IF(ISBLANK('FY22-23 Work Plan'!$J$17:$J$17),\"\",'FY22-23 Work Plan'!$J$17:$J$17)","v":"j.doe@preventionusa.com"},{"$f":"IF(ISBLANK('FY22-23 Work Plan'!$E$18:$E$18),\"\",'FY22-23 Work Plan'!$E$18:$E$18)","v":"John/Jane Doe"},{"$f":"IF(ISBLANK('FY22-23 Work Plan'!$H$18:$H$18),\"\",TEXT('FY22-23 Work Plan'!$H$18:$H$18,\"###-###-####\"))","v":"213-555-1213"},{"$f":"IF(ISBLANK('FY22-23 Work Plan'!$J$18:$J$18),\"\",'FY22-23 Work Plan'!$J$18:$J$18)","v":"j.doe@preventionusa.com"},{"$f":"IF(ISBLANK('FY22-23 Work Plan'!$E$19:$E$19),\"\",'FY22-23 Work Plan'!$E$19:$E$19)","v":"John/Jane Doe"},{"$f":"IF(ISBLANK('FY22-23 Work Plan'!$H$19:$H$19),\"\",TEXT('FY22-23 Work Plan'!$H$19:$H$19,\"###-###-####\"))","v":"213-555-1213"},{"$f":"IF(ISBLANK('FY22-23 Work Plan'!$J$19:$J$19),\"\",'FY22-23 Work Plan'!$J$19:$J$19)","v":"j.doe@preventionusa.com"},{"$f":"IF(ISBLANK('FY22-23 Work Plan'!$D$23:$D$23),\"\",'FY22-23 Work Plan'!$D$23:$D$23)","v":""},{"$f":"IF(ISBLANK('FY22-23 Work Plan'!$H$23:$H$23),\"\",'FY22-23 Work Plan'!$H$23:$H$23)","v":""},{"$f":"IF(ISBLANK('FY22-23 Work Plan'!$D$24:$D$24),\"\",'FY22-23 Work Plan'!$D$24:$D$24)","v":""},{"$f":"IF(ISBLANK('FY22-23 Work Plan'!$H$24:$H$24),\"\",'FY22-23 Work Plan'!$H$24:$H$24)","v":""},{"$f":"IF(ISBLANK('FY22-23 Work Plan'!$D$25:$D$25),\"\",'FY22-23 Work Plan'!$D$25:$D$25)","v":""},{"$f":"IF(ISBLANK('FY22-23 Work Plan'!$H$25:$H$25),\"\",'FY22-23 Work Plan'!$H$25:$H$25)","v":""},{"$f":"IF(ISBLANK('FY22-23 Work Plan'!$D$26:$D$26),\"\",'FY22-23 Work Plan'!$D$26:$D$26)","v":""},{"$f":"IF(ISBLANK('FY22-23 Work Plan'!$H$26:$H$26),\"\",'FY22-23 Work Plan'!$H$26:$H$26)","v":""},{"$f":"IF(ISBLANK('FY22-23 Work Plan'!$D$27:$D$27),\"\",'FY22-23 Work Plan'!$D$27:$D$27)","v":""},{"$f":"IF(ISBLANK('FY22-23 Work Plan'!$H$27:$H$27),\"\",'FY22-23 Work Plan'!$H$27:$H$27)","v":""},{"$f":"IF(ISBLANK('FY22-23 Work Plan'!$D$28:$D$28),\"\",'FY22-23 Work Plan'!$D$28:$D$28)","v":""},{"$f":"IF(ISBLANK('FY22-23 Work Plan'!$H$28:$H$28),\"\",'FY22-23 Work Plan'!$H$28:$H$28)","v":""},{"$f":"IF(ISBLANK('FY22-23 Work Plan'!$D$29:$D$29),\"\",'FY22-23 Work Plan'!$D$29:$D$29)","v":""},{"$f":"IF(ISBLANK('FY22-23 Work Plan'!$H$29:$H$29),\"\",'FY22-23 Work Plan'!$H$29:$H$29)","v":""},{"$f":"IF(ISBLANK('FY22-23 Work Plan'!$B$30:$B$30),\"\",'FY22-23 Work Plan'!$B$30:$B$30)","v":""},{"$f":"IF(ISBLANK('FY22-23 Work Plan'!$D$30:$D$30),\"\",'FY22-23 Work Plan'!$D$30:$D$30)","v":""},{"$f":"IF(ISBLANK('FY22-23 Work Plan'!$H$30:$H$30),\"\",'FY22-23 Work Plan'!$H$30:$H$30)","v":""},{"$f":"IF(ISBLANK('FY22-23 Work Plan'!$B$31:$B$31),\"\",'FY22-23 Work Plan'!$B$31:$B$31)","v":""},{"$f":"IF(ISBLANK('FY22-23 Work Plan'!$D$31:$D$31),\"\",'FY22-23 Work Plan'!$D$31:$D$31)","v":""},{"$f":"IF(ISBLANK('FY22-23 Work Plan'!$H$31:$H$31),\"\",'FY22-23 Work Plan'!$H$31:$H$31)","v":""},{"$f":"IF(ISBLANK('FY22-23 Work Plan'!$B$32:$B$32),\"\",'FY22-23 Work Plan'!$B$32:$B$32)","v":""},{"$f":"IF(ISBLANK('FY22-23 Work Plan'!$D$32:$D$32),\"\",'FY22-23 Work Plan'!$D$32:$D$32)","v":""},{"$f":"IF(ISBLANK('FY22-23 Work Plan'!$H$32:$H$32),\"\",'FY22-23 Work Plan'!$H$32:$H$32)","v":""},{"$f":"IF(ISBLANK('FY22-23 Work Plan'!A66),\"\",'FY22-23 Work Plan'!A66)","v":""},{"$f":"IF(ISBLANK('FY22-23 Work Plan'!D66),\"\",'FY22-23 Work Plan'!D66)","v":""},{"$f":"IF(ISBLANK('FY22-23 Work Plan'!E66),\"\",'FY22-23 Work Plan'!E66)","v":""},{"$f":"IF(ISBLANK('FY22-23 Work Plan'!F66),\"\",'FY22-23 Work Plan'!F66)","v":""},{"$f":"IF(ISBLANK('FY22-23 Work Plan'!H66),\"\",'FY22-23 Work Plan'!H66)","v":""},{"$f":"IF(ISBLANK('FY22-23 Work Plan'!I66),\"\",'FY22-23 Work Plan'!I66)","v":""},{"$f":"IF(ISBLANK('FY22-23 Work Plan'!J66),\"\",'FY22-23 Work Plan'!J66)","v":""},{"$f":"IF(ISBLANK('FY22-23 Work Plan'!K66),\"\",'FY22-23 Work Plan'!K66)","v":""},{"$f":"IF(ISBLANK('FY22-23 Work Plan'!L66),\"\",'FY22-23 Work Plan'!L66)","v":""}]
[{"$f":"IF(ISBLANK('FY22-23 Work Plan'!$E$2:$E$2),\"\",'FY22-23 Work Plan'!$E$2:$E$2)","v":"Asian American Drug Abuse Programs, Inc. (AADAP)"},{"$f":"IF(ISBLANK('FY22-23 Work Plan'!$J$2:$J$2),\"\",'FY22-23 Work Plan'!$J$2:$J$2)","v":"Prevention Education Program (PEP)"},{"$f":"IF(ISBLANK('FY22-23 Work Plan'!$J$3:$J$3),\"\",'FY22-23 Work Plan'!$J$3:$J$3)","v":""},{"$f":"IF(ISBLANK('FY22-23 Work Plan'!$E$3:$E$3),\"\",'FY22-23 Work Plan'!$E$3:$E$3)","v":"PH-004367"},{"$f":"IF(ISBLANK('FY22-23 Work Plan'!$E$4:$E$4),\"\",TEXT('FY22-23 Work Plan'!$E$4:$E$4,\"000000\"))","v":"000001"},{"$f":"IF(ISBLANK('FY22-23 Work Plan'!$J$4:$J$4),\"\",'FY22-23 Work Plan'!$J$4:$J$4)","v":"Building Skills"},{"$f":"IF(ISBLANK('FY22-23 Work Plan'!$E$5:$E$5),\"\",'FY22-23 Work Plan'!$E$5:$E$5)","v":"2 - San Fernando Valley"},{"$f":"IF(ISBLANK('FY22-23 Work Plan'!$J$5:$J$5),\"\",'FY22-23 Work Plan'!$J$5:$J$5)","v":"3rd District, 4th District"},{"$f":"IF(ISBLANK('FY22-23 Work Plan'!$E$6:$E$6),\"\",'FY22-23 Work Plan'!$E$6:$E$6)","v":"Angeles National Forest*, Artesia, Altadena*"},{"$f":"IF(ISBLANK('FY22-23 Work Plan'!$E$7:$E$7),\"\",'FY22-23 Work Plan'!$E$7:$E$7)","v":"Cadillac-Corning, Angeles National Forest"},{"$f":"IF(ISBLANK('FY22-23 Work Plan'!$E$8:$E$8),\"\",'FY22-23 Work Plan'!$E$8:$E$8)","v":"90032, 90036"},{"$f":"IF(ISBLANK('FY22-23 Work Plan'!$E$9:$E$9),\"\",'FY22-23 Work Plan'!$E$9:$E$9)","v":"123 E Main St., Suite 100 \nAnytown, CA 90000"},{"$f":"IF(ISBLANK('FY22-23 Work Plan'!$J$9:$J$9),\"\",TEXT('FY22-23 Work Plan'!$J$9:$J$9,\"###-###-####\"))","v":"999-999-9999"},{"$f":"IF(ISBLANK('FY22-23 Work Plan'!$J$10:$J$10),\"\",'FY22-23 Work Plan'!$J$10:$J$10)","v":"www.abc1.org"},{"$f":"IF(ISBLANK('FY22-23 Work Plan'!$E$11:$E$11),\"\",'FY22-23 Work Plan'!$E$11:$E$11)","v":"123 E Main St., Suite 100 \nAnytown, CA 90000"},{"$f":"IF(ISBLANK('FY22-23 Work Plan'!$J$11:$J$11),\"\",TEXT('FY22-23 Work Plan'!$J$11:$J$11,\"###-###-####\"))","v":"999-999-9999"},{"$f":"IF(ISBLANK('FY22-23 Work Plan'!$J$12:$J$12),\"\",'FY22-23 Work Plan'!$J$12:$J$12)","v":"www.abc2.org"},{"$f":"IF(ISBLANK('FY22-23 Work Plan'!$E$15:$E$15),\"\",'FY22-23 Work Plan'!$E$15:$E$15)","v":"John/Jane Doe"},{"$f":"IF(ISBLANK('FY22-23 Work Plan'!$H$15:$H$15),\"\",TEXT('FY22-23 Work Plan'!$H$15:$H$15,\"###-###-####\"))","v":"213-555-1212"},{"$f":"IF(ISBLANK('FY22-23 Work Plan'!$J$15:$J$15),\"\",'FY22-23 Work Plan'!$J$15:$J$15)","v":"janedoe@preventionusa.com"},{"$f":"IF(ISBLANK('FY22-23 Work Plan'!$E$16:$E$16),\"\",'FY22-23 Work Plan'!$E$16:$E$16)","v":"John/Jane Doe"},{"$f":"IF(ISBLANK('FY22-23 Work Plan'!$H$16:$H$16),\"\",TEXT('FY22-23 Work Plan'!$H$16:$H$16,\"###-###-####\"))","v":"213-555-1212"},{"$f":"IF(ISBLANK('FY22-23 Work Plan'!$J$16:$J$16),\"\",'FY22-23 Work Plan'!$J$16:$J$16)","v":"janedoe@preventionusa.com"},{"$f":"IF(ISBLANK('FY22-23 Work Plan'!$E$17:$E$17),\"\",'FY22-23 Work Plan'!$E$17:$E$17)","v":"John/Jane Doe"},{"$f":"IF(ISBLANK('FY22-23 Work Plan'!$H$17:$H$17),\"\",TEXT('FY22-23 Work Plan'!$H$17:$H$17,\"###-###-####\"))","v":"213-555-1212"},{"$f":"IF(ISBLANK('FY22-23 Work Plan'!$J$17:$J$17),\"\",'FY22-23 Work Plan'!$J$17:$J$17)","v":"j.doe@preventionusa.com"},{"$f":"IF(ISBLANK('FY22-23 Work Plan'!$E$18:$E$18),\"\",'FY22-23 Work Plan'!$E$18:$E$18)","v":"John/Jane Doe"},{"$f":"IF(ISBLANK('FY22-23 Work Plan'!$H$18:$H$18),\"\",TEXT('FY22-23 Work Plan'!$H$18:$H$18,\"###-###-####\"))","v":"213-555-1213"},{"$f":"IF(ISBLANK('FY22-23 Work Plan'!$J$18:$J$18),\"\",'FY22-23 Work Plan'!$J$18:$J$18)","v":"j.doe@preventionusa.com"},{"$f":"IF(ISBLANK('FY22-23 Work Plan'!$E$19:$E$19),\"\",'FY22-23 Work Plan'!$E$19:$E$19)","v":"John/Jane Doe"},{"$f":"IF(ISBLANK('FY22-23 Work Plan'!$H$19:$H$19),\"\",TEXT('FY22-23 Work Plan'!$H$19:$H$19,\"###-###-####\"))","v":"213-555-1213"},{"$f":"IF(ISBLANK('FY22-23 Work Plan'!$J$19:$J$19),\"\",'FY22-23 Work Plan'!$J$19:$J$19)","v":"j.doe@preventionusa.com"},{"$f":"IF(ISBLANK('FY22-23 Work Plan'!$D$23:$D$23),\"\",'FY22-23 Work Plan'!$D$23:$D$23)","v":""},{"$f":"IF(ISBLANK('FY22-23 Work Plan'!$H$23:$H$23),\"\",'FY22-23 Work Plan'!$H$23:$H$23)","v":""},{"$f":"IF(ISBLANK('FY22-23 Work Plan'!$D$24:$D$24),\"\",'FY22-23 Work Plan'!$D$24:$D$24)","v":""},{"$f":"IF(ISBLANK('FY22-23 Work Plan'!$H$24:$H$24),\"\",'FY22-23 Work Plan'!$H$24:$H$24)","v":""},{"$f":"IF(ISBLANK('FY22-23 Work Plan'!$D$25:$D$25),\"\",'FY22-23 Work Plan'!$D$25:$D$25)","v":""},{"$f":"IF(ISBLANK('FY22-23 Work Plan'!$H$25:$H$25),\"\",'FY22-23 Work Plan'!$H$25:$H$25)","v":""},{"$f":"IF(ISBLANK('FY22-23 Work Plan'!$D$26:$D$26),\"\",'FY22-23 Work Plan'!$D$26:$D$26)","v":""},{"$f":"IF(ISBLANK('FY22-23 Work Plan'!$H$26:$H$26),\"\",'FY22-23 Work Plan'!$H$26:$H$26)","v":""},{"$f":"IF(ISBLANK('FY22-23 Work Plan'!$D$27:$D$27),\"\",'FY22-23 Work Plan'!$D$27:$D$27)","v":""},{"$f":"IF(ISBLANK('FY22-23 Work Plan'!$H$27:$H$27),\"\",'FY22-23 Work Plan'!$H$27:$H$27)","v":""},{"$f":"IF(ISBLANK('FY22-23 Work Plan'!$D$28:$D$28),\"\",'FY22-23 Work Plan'!$D$28:$D$28)","v":""},{"$f":"IF(ISBLANK('FY22-23 Work Plan'!$H$28:$H$28),\"\",'FY22-23 Work Plan'!$H$28:$H$28)","v":""},{"$f":"IF(ISBLANK('FY22-23 Work Plan'!$D$29:$D$29),\"\",'FY22-23 Work Plan'!$D$29:$D$29)","v":""},{"$f":"IF(ISBLANK('FY22-23 Work Plan'!$H$29:$H$29),\"\",'FY22-23 Work Plan'!$H$29:$H$29)","v":""},{"$f":"IF(ISBLANK('FY22-23 Work Plan'!$B$30:$B$30),\"\",'FY22-23 Work Plan'!$B$30:$B$30)","v":""},{"$f":"IF(ISBLANK('FY22-23 Work Plan'!$D$30:$D$30),\"\",'FY22-23 Work Plan'!$D$30:$D$30)","v":""},{"$f":"IF(ISBLANK('FY22-23 Work Plan'!$H$30:$H$30),\"\",'FY22-23 Work Plan'!$H$30:$H$30)","v":""},{"$f":"IF(ISBLANK('FY22-23 Work Plan'!$B$31:$B$31),\"\",'FY22-23 Work Plan'!$B$31:$B$31)","v":""},{"$f":"IF(ISBLANK('FY22-23 Work Plan'!$D$31:$D$31),\"\",'FY22-23 Work Plan'!$D$31:$D$31)","v":""},{"$f":"IF(ISBLANK('FY22-23 Work Plan'!$H$31:$H$31),\"\",'FY22-23 Work Plan'!$H$31:$H$31)","v":""},{"$f":"IF(ISBLANK('FY22-23 Work Plan'!$B$32:$B$32),\"\",'FY22-23 Work Plan'!$B$32:$B$32)","v":""},{"$f":"IF(ISBLANK('FY22-23 Work Plan'!$D$32:$D$32),\"\",'FY22-23 Work Plan'!$D$32:$D$32)","v":""},{"$f":"IF(ISBLANK('FY22-23 Work Plan'!$H$32:$H$32),\"\",'FY22-23 Work Plan'!$H$32:$H$32)","v":""},{"$f":"IF(ISBLANK('FY22-23 Work Plan'!A67),\"\",'FY22-23 Work Plan'!A67)","v":""},{"$f":"IF(ISBLANK('FY22-23 Work Plan'!D67),\"\",'FY22-23 Work Plan'!D67)","v":""},{"$f":"IF(ISBLANK('FY22-23 Work Plan'!E67),\"\",'FY22-23 Work Plan'!E67)","v":""},{"$f":"IF(ISBLANK('FY22-23 Work Plan'!F67),\"\",'FY22-23 Work Plan'!F67)","v":""},{"$f":"IF(ISBLANK('FY22-23 Work Plan'!H67),\"\",'FY22-23 Work Plan'!H67)","v":""},{"$f":"IF(ISBLANK('FY22-23 Work Plan'!I67),\"\",'FY22-23 Work Plan'!I67)","v":""},{"$f":"IF(ISBLANK('FY22-23 Work Plan'!J67),\"\",'FY22-23 Work Plan'!J67)","v":""},{"$f":"IF(ISBLANK('FY22-23 Work Plan'!K67),\"\",'FY22-23 Work Plan'!K67)","v":""},{"$f":"IF(ISBLANK('FY22-23 Work Plan'!L67),\"\",'FY22-23 Work Plan'!L67)","v":""}]
[{"$f":"IF(ISBLANK('FY22-23 Work Plan'!$E$2:$E$2),\"\",'FY22-23 Work Plan'!$E$2:$E$2)","v":"Asian American Drug Abuse Programs, Inc. (AADAP)"},{"$f":"IF(ISBLANK('FY22-23 Work Plan'!$J$2:$J$2),\"\",'FY22-23 Work Plan'!$J$2:$J$2)","v":"Prevention Education Program (PEP)"},{"$f":"IF(ISBLANK('FY22-23 Work Plan'!$J$3:$J$3),\"\",'FY22-23 Work Plan'!$J$3:$J$3)","v":""},{"$f":"IF(ISBLANK('FY22-23 Work Plan'!$E$3:$E$3),\"\",'FY22-23 Work Plan'!$E$3:$E$3)","v":"PH-004367"},{"$f":"IF(ISBLANK('FY22-23 Work Plan'!$E$4:$E$4),\"\",TEXT('FY22-23 Work Plan'!$E$4:$E$4,\"000000\"))","v":"000001"},{"$f":"IF(ISBLANK('FY22-23 Work Plan'!$J$4:$J$4),\"\",'FY22-23 Work Plan'!$J$4:$J$4)","v":"Building Skills"},{"$f":"IF(ISBLANK('FY22-23 Work Plan'!$E$5:$E$5),\"\",'FY22-23 Work Plan'!$E$5:$E$5)","v":"2 - San Fernando Valley"},{"$f":"IF(ISBLANK('FY22-23 Work Plan'!$J$5:$J$5),\"\",'FY22-23 Work Plan'!$J$5:$J$5)","v":"3rd District, 4th District"},{"$f":"IF(ISBLANK('FY22-23 Work Plan'!$E$6:$E$6),\"\",'FY22-23 Work Plan'!$E$6:$E$6)","v":"Angeles National Forest*, Artesia, Altadena*"},{"$f":"IF(ISBLANK('FY22-23 Work Plan'!$E$7:$E$7),\"\",'FY22-23 Work Plan'!$E$7:$E$7)","v":"Cadillac-Corning, Angeles National Forest"},{"$f":"IF(ISBLANK('FY22-23 Work Plan'!$E$8:$E$8),\"\",'FY22-23 Work Plan'!$E$8:$E$8)","v":"90032, 90036"},{"$f":"IF(ISBLANK('FY22-23 Work Plan'!$E$9:$E$9),\"\",'FY22-23 Work Plan'!$E$9:$E$9)","v":"123 E Main St., Suite 100 \nAnytown, CA 90000"},{"$f":"IF(ISBLANK('FY22-23 Work Plan'!$J$9:$J$9),\"\",TEXT('FY22-23 Work Plan'!$J$9:$J$9,\"###-###-####\"))","v":"999-999-9999"},{"$f":"IF(ISBLANK('FY22-23 Work Plan'!$J$10:$J$10),\"\",'FY22-23 Work Plan'!$J$10:$J$10)","v":"www.abc1.org"},{"$f":"IF(ISBLANK('FY22-23 Work Plan'!$E$11:$E$11),\"\",'FY22-23 Work Plan'!$E$11:$E$11)","v":"123 E Main St., Suite 100 \nAnytown, CA 90000"},{"$f":"IF(ISBLANK('FY22-23 Work Plan'!$J$11:$J$11),\"\",TEXT('FY22-23 Work Plan'!$J$11:$J$11,\"###-###-####\"))","v":"999-999-9999"},{"$f":"IF(ISBLANK('FY22-23 Work Plan'!$J$12:$J$12),\"\",'FY22-23 Work Plan'!$J$12:$J$12)","v":"www.abc2.org"},{"$f":"IF(ISBLANK('FY22-23 Work Plan'!$E$15:$E$15),\"\",'FY22-23 Work Plan'!$E$15:$E$15)","v":"John/Jane Doe"},{"$f":"IF(ISBLANK('FY22-23 Work Plan'!$H$15:$H$15),\"\",TEXT('FY22-23 Work Plan'!$H$15:$H$15,\"###-###-####\"))","v":"213-555-1212"},{"$f":"IF(ISBLANK('FY22-23 Work Plan'!$J$15:$J$15),\"\",'FY22-23 Work Plan'!$J$15:$J$15)","v":"janedoe@preventionusa.com"},{"$f":"IF(ISBLANK('FY22-23 Work Plan'!$E$16:$E$16),\"\",'FY22-23 Work Plan'!$E$16:$E$16)","v":"John/Jane Doe"},{"$f":"IF(ISBLANK('FY22-23 Work Plan'!$H$16:$H$16),\"\",TEXT('FY22-23 Work Plan'!$H$16:$H$16,\"###-###-####\"))","v":"213-555-1212"},{"$f":"IF(ISBLANK('FY22-23 Work Plan'!$J$16:$J$16),\"\",'FY22-23 Work Plan'!$J$16:$J$16)","v":"janedoe@preventionusa.com"},{"$f":"IF(ISBLANK('FY22-23 Work Plan'!$E$17:$E$17),\"\",'FY22-23 Work Plan'!$E$17:$E$17)","v":"John/Jane Doe"},{"$f":"IF(ISBLANK('FY22-23 Work Plan'!$H$17:$H$17),\"\",TEXT('FY22-23 Work Plan'!$H$17:$H$17,\"###-###-####\"))","v":"213-555-1212"},{"$f":"IF(ISBLANK('FY22-23 Work Plan'!$J$17:$J$17),\"\",'FY22-23 Work Plan'!$J$17:$J$17)","v":"j.doe@preventionusa.com"},{"$f":"IF(ISBLANK('FY22-23 Work Plan'!$E$18:$E$18),\"\",'FY22-23 Work Plan'!$E$18:$E$18)","v":"John/Jane Doe"},{"$f":"IF(ISBLANK('FY22-23 Work Plan'!$H$18:$H$18),\"\",TEXT('FY22-23 Work Plan'!$H$18:$H$18,\"###-###-####\"))","v":"213-555-1213"},{"$f":"IF(ISBLANK('FY22-23 Work Plan'!$J$18:$J$18),\"\",'FY22-23 Work Plan'!$J$18:$J$18)","v":"j.doe@preventionusa.com"},{"$f":"IF(ISBLANK('FY22-23 Work Plan'!$E$19:$E$19),\"\",'FY22-23 Work Plan'!$E$19:$E$19)","v":"John/Jane Doe"},{"$f":"IF(ISBLANK('FY22-23 Work Plan'!$H$19:$H$19),\"\",TEXT('FY22-23 Work Plan'!$H$19:$H$19,\"###-###-####\"))","v":"213-555-1213"},{"$f":"IF(ISBLANK('FY22-23 Work Plan'!$J$19:$J$19),\"\",'FY22-23 Work Plan'!$J$19:$J$19)","v":"j.doe@preventionusa.com"},{"$f":"IF(ISBLANK('FY22-23 Work Plan'!$D$23:$D$23),\"\",'FY22-23 Work Plan'!$D$23:$D$23)","v":""},{"$f":"IF(ISBLANK('FY22-23 Work Plan'!$H$23:$H$23),\"\",'FY22-23 Work Plan'!$H$23:$H$23)","v":""},{"$f":"IF(ISBLANK('FY22-23 Work Plan'!$D$24:$D$24),\"\",'FY22-23 Work Plan'!$D$24:$D$24)","v":""},{"$f":"IF(ISBLANK('FY22-23 Work Plan'!$H$24:$H$24),\"\",'FY22-23 Work Plan'!$H$24:$H$24)","v":""},{"$f":"IF(ISBLANK('FY22-23 Work Plan'!$D$25:$D$25),\"\",'FY22-23 Work Plan'!$D$25:$D$25)","v":""},{"$f":"IF(ISBLANK('FY22-23 Work Plan'!$H$25:$H$25),\"\",'FY22-23 Work Plan'!$H$25:$H$25)","v":""},{"$f":"IF(ISBLANK('FY22-23 Work Plan'!$D$26:$D$26),\"\",'FY22-23 Work Plan'!$D$26:$D$26)","v":""},{"$f":"IF(ISBLANK('FY22-23 Work Plan'!$H$26:$H$26),\"\",'FY22-23 Work Plan'!$H$26:$H$26)","v":""},{"$f":"IF(ISBLANK('FY22-23 Work Plan'!$D$27:$D$27),\"\",'FY22-23 Work Plan'!$D$27:$D$27)","v":""},{"$f":"IF(ISBLANK('FY22-23 Work Plan'!$H$27:$H$27),\"\",'FY22-23 Work Plan'!$H$27:$H$27)","v":""},{"$f":"IF(ISBLANK('FY22-23 Work Plan'!$D$28:$D$28),\"\",'FY22-23 Work Plan'!$D$28:$D$28)","v":""},{"$f":"IF(ISBLANK('FY22-23 Work Plan'!$H$28:$H$28),\"\",'FY22-23 Work Plan'!$H$28:$H$28)","v":""},{"$f":"IF(ISBLANK('FY22-23 Work Plan'!$D$29:$D$29),\"\",'FY22-23 Work Plan'!$D$29:$D$29)","v":""},{"$f":"IF(ISBLANK('FY22-23 Work Plan'!$H$29:$H$29),\"\",'FY22-23 Work Plan'!$H$29:$H$29)","v":""},{"$f":"IF(ISBLANK('FY22-23 Work Plan'!$B$30:$B$30),\"\",'FY22-23 Work Plan'!$B$30:$B$30)","v":""},{"$f":"IF(ISBLANK('FY22-23 Work Plan'!$D$30:$D$30),\"\",'FY22-23 Work Plan'!$D$30:$D$30)","v":""},{"$f":"IF(ISBLANK('FY22-23 Work Plan'!$H$30:$H$30),\"\",'FY22-23 Work Plan'!$H$30:$H$30)","v":""},{"$f":"IF(ISBLANK('FY22-23 Work Plan'!$B$31:$B$31),\"\",'FY22-23 Work Plan'!$B$31:$B$31)","v":""},{"$f":"IF(ISBLANK('FY22-23 Work Plan'!$D$31:$D$31),\"\",'FY22-23 Work Plan'!$D$31:$D$31)","v":""},{"$f":"IF(ISBLANK('FY22-23 Work Plan'!$H$31:$H$31),\"\",'FY22-23 Work Plan'!$H$31:$H$31)","v":""},{"$f":"IF(ISBLANK('FY22-23 Work Plan'!$B$32:$B$32),\"\",'FY22-23 Work Plan'!$B$32:$B$32)","v":""},{"$f":"IF(ISBLANK('FY22-23 Work Plan'!$D$32:$D$32),\"\",'FY22-23 Work Plan'!$D$32:$D$32)","v":""},{"$f":"IF(ISBLANK('FY22-23 Work Plan'!$H$32:$H$32),\"\",'FY22-23 Work Plan'!$H$32:$H$32)","v":""},{"$f":"IF(ISBLANK('FY22-23 Work Plan'!A68),\"\",'FY22-23 Work Plan'!A68)","v":""},{"$f":"IF(ISBLANK('FY22-23 Work Plan'!D68),\"\",'FY22-23 Work Plan'!D68)","v":""},{"$f":"IF(ISBLANK('FY22-23 Work Plan'!E68),\"\",'FY22-23 Work Plan'!E68)","v":""},{"$f":"IF(ISBLANK('FY22-23 Work Plan'!F68),\"\",'FY22-23 Work Plan'!F68)","v":""},{"$f":"IF(ISBLANK('FY22-23 Work Plan'!H68),\"\",'FY22-23 Work Plan'!H68)","v":""},{"$f":"IF(ISBLANK('FY22-23 Work Plan'!I68),\"\",'FY22-23 Work Plan'!I68)","v":""},{"$f":"IF(ISBLANK('FY22-23 Work Plan'!J68),\"\",'FY22-23 Work Plan'!J68)","v":""},{"$f":"IF(ISBLANK('FY22-23 Work Plan'!K68),\"\",'FY22-23 Work Plan'!K68)","v":""},{"$f":"IF(ISBLANK('FY22-23 Work Plan'!L68),\"\",'FY22-23 Work Plan'!L68)","v":""}]
[{"$f":"IF(ISBLANK('FY22-23 Work Plan'!$E$2:$E$2),\"\",'FY22-23 Work Plan'!$E$2:$E$2)","v":"Asian American Drug Abuse Programs, Inc. (AADAP)"},{"$f":"IF(ISBLANK('FY22-23 Work Plan'!$J$2:$J$2),\"\",'FY22-23 Work Plan'!$J$2:$J$2)","v":"Prevention Education Program (PEP)"},{"$f":"IF(ISBLANK('FY22-23 Work Plan'!$J$3:$J$3),\"\",'FY22-23 Work Plan'!$J$3:$J$3)","v":""},{"$f":"IF(ISBLANK('FY22-23 Work Plan'!$E$3:$E$3),\"\",'FY22-23 Work Plan'!$E$3:$E$3)","v":"PH-004367"},{"$f":"IF(ISBLANK('FY22-23 Work Plan'!$E$4:$E$4),\"\",TEXT('FY22-23 Work Plan'!$E$4:$E$4,\"000000\"))","v":"000001"},{"$f":"IF(ISBLANK('FY22-23 Work Plan'!$J$4:$J$4),\"\",'FY22-23 Work Plan'!$J$4:$J$4)","v":"Building Skills"},{"$f":"IF(ISBLANK('FY22-23 Work Plan'!$E$5:$E$5),\"\",'FY22-23 Work Plan'!$E$5:$E$5)","v":"2 - San Fernando Valley"},{"$f":"IF(ISBLANK('FY22-23 Work Plan'!$J$5:$J$5),\"\",'FY22-23 Work Plan'!$J$5:$J$5)","v":"3rd District, 4th District"},{"$f":"IF(ISBLANK('FY22-23 Work Plan'!$E$6:$E$6),\"\",'FY22-23 Work Plan'!$E$6:$E$6)","v":"Angeles National Forest*, Artesia, Altadena*"},{"$f":"IF(ISBLANK('FY22-23 Work Plan'!$E$7:$E$7),\"\",'FY22-23 Work Plan'!$E$7:$E$7)","v":"Cadillac-Corning, Angeles National Forest"},{"$f":"IF(ISBLANK('FY22-23 Work Plan'!$E$8:$E$8),\"\",'FY22-23 Work Plan'!$E$8:$E$8)","v":"90032, 90036"},{"$f":"IF(ISBLANK('FY22-23 Work Plan'!$E$9:$E$9),\"\",'FY22-23 Work Plan'!$E$9:$E$9)","v":"123 E Main St., Suite 100 \nAnytown, CA 90000"},{"$f":"IF(ISBLANK('FY22-23 Work Plan'!$J$9:$J$9),\"\",TEXT('FY22-23 Work Plan'!$J$9:$J$9,\"###-###-####\"))","v":"999-999-9999"},{"$f":"IF(ISBLANK('FY22-23 Work Plan'!$J$10:$J$10),\"\",'FY22-23 Work Plan'!$J$10:$J$10)","v":"www.abc1.org"},{"$f":"IF(ISBLANK('FY22-23 Work Plan'!$E$11:$E$11),\"\",'FY22-23 Work Plan'!$E$11:$E$11)","v":"123 E Main St., Suite 100 \nAnytown, CA 90000"},{"$f":"IF(ISBLANK('FY22-23 Work Plan'!$J$11:$J$11),\"\",TEXT('FY22-23 Work Plan'!$J$11:$J$11,\"###-###-####\"))","v":"999-999-9999"},{"$f":"IF(ISBLANK('FY22-23 Work Plan'!$J$12:$J$12),\"\",'FY22-23 Work Plan'!$J$12:$J$12)","v":"www.abc2.org"},{"$f":"IF(ISBLANK('FY22-23 Work Plan'!$E$15:$E$15),\"\",'FY22-23 Work Plan'!$E$15:$E$15)","v":"John/Jane Doe"},{"$f":"IF(ISBLANK('FY22-23 Work Plan'!$H$15:$H$15),\"\",TEXT('FY22-23 Work Plan'!$H$15:$H$15,\"###-###-####\"))","v":"213-555-1212"},{"$f":"IF(ISBLANK('FY22-23 Work Plan'!$J$15:$J$15),\"\",'FY22-23 Work Plan'!$J$15:$J$15)","v":"janedoe@preventionusa.com"},{"$f":"IF(ISBLANK('FY22-23 Work Plan'!$E$16:$E$16),\"\",'FY22-23 Work Plan'!$E$16:$E$16)","v":"John/Jane Doe"},{"$f":"IF(ISBLANK('FY22-23 Work Plan'!$H$16:$H$16),\"\",TEXT('FY22-23 Work Plan'!$H$16:$H$16,\"###-###-####\"))","v":"213-555-1212"},{"$f":"IF(ISBLANK('FY22-23 Work Plan'!$J$16:$J$16),\"\",'FY22-23 Work Plan'!$J$16:$J$16)","v":"janedoe@preventionusa.com"},{"$f":"IF(ISBLANK('FY22-23 Work Plan'!$E$17:$E$17),\"\",'FY22-23 Work Plan'!$E$17:$E$17)","v":"John/Jane Doe"},{"$f":"IF(ISBLANK('FY22-23 Work Plan'!$H$17:$H$17),\"\",TEXT('FY22-23 Work Plan'!$H$17:$H$17,\"###-###-####\"))","v":"213-555-1212"},{"$f":"IF(ISBLANK('FY22-23 Work Plan'!$J$17:$J$17),\"\",'FY22-23 Work Plan'!$J$17:$J$17)","v":"j.doe@preventionusa.com"},{"$f":"IF(ISBLANK('FY22-23 Work Plan'!$E$18:$E$18),\"\",'FY22-23 Work Plan'!$E$18:$E$18)","v":"John/Jane Doe"},{"$f":"IF(ISBLANK('FY22-23 Work Plan'!$H$18:$H$18),\"\",TEXT('FY22-23 Work Plan'!$H$18:$H$18,\"###-###-####\"))","v":"213-555-1213"},{"$f":"IF(ISBLANK('FY22-23 Work Plan'!$J$18:$J$18),\"\",'FY22-23 Work Plan'!$J$18:$J$18)","v":"j.doe@preventionusa.com"},{"$f":"IF(ISBLANK('FY22-23 Work Plan'!$E$19:$E$19),\"\",'FY22-23 Work Plan'!$E$19:$E$19)","v":"John/Jane Doe"},{"$f":"IF(ISBLANK('FY22-23 Work Plan'!$H$19:$H$19),\"\",TEXT('FY22-23 Work Plan'!$H$19:$H$19,\"###-###-####\"))","v":"213-555-1213"},{"$f":"IF(ISBLANK('FY22-23 Work Plan'!$J$19:$J$19),\"\",'FY22-23 Work Plan'!$J$19:$J$19)","v":"j.doe@preventionusa.com"},{"$f":"IF(ISBLANK('FY22-23 Work Plan'!$D$23:$D$23),\"\",'FY22-23 Work Plan'!$D$23:$D$23)","v":""},{"$f":"IF(ISBLANK('FY22-23 Work Plan'!$H$23:$H$23),\"\",'FY22-23 Work Plan'!$H$23:$H$23)","v":""},{"$f":"IF(ISBLANK('FY22-23 Work Plan'!$D$24:$D$24),\"\",'FY22-23 Work Plan'!$D$24:$D$24)","v":""},{"$f":"IF(ISBLANK('FY22-23 Work Plan'!$H$24:$H$24),\"\",'FY22-23 Work Plan'!$H$24:$H$24)","v":""},{"$f":"IF(ISBLANK('FY22-23 Work Plan'!$D$25:$D$25),\"\",'FY22-23 Work Plan'!$D$25:$D$25)","v":""},{"$f":"IF(ISBLANK('FY22-23 Work Plan'!$H$25:$H$25),\"\",'FY22-23 Work Plan'!$H$25:$H$25)","v":""},{"$f":"IF(ISBLANK('FY22-23 Work Plan'!$D$26:$D$26),\"\",'FY22-23 Work Plan'!$D$26:$D$26)","v":""},{"$f":"IF(ISBLANK('FY22-23 Work Plan'!$H$26:$H$26),\"\",'FY22-23 Work Plan'!$H$26:$H$26)","v":""},{"$f":"IF(ISBLANK('FY22-23 Work Plan'!$D$27:$D$27),\"\",'FY22-23 Work Plan'!$D$27:$D$27)","v":""},{"$f":"IF(ISBLANK('FY22-23 Work Plan'!$H$27:$H$27),\"\",'FY22-23 Work Plan'!$H$27:$H$27)","v":""},{"$f":"IF(ISBLANK('FY22-23 Work Plan'!$D$28:$D$28),\"\",'FY22-23 Work Plan'!$D$28:$D$28)","v":""},{"$f":"IF(ISBLANK('FY22-23 Work Plan'!$H$28:$H$28),\"\",'FY22-23 Work Plan'!$H$28:$H$28)","v":""},{"$f":"IF(ISBLANK('FY22-23 Work Plan'!$D$29:$D$29),\"\",'FY22-23 Work Plan'!$D$29:$D$29)","v":""},{"$f":"IF(ISBLANK('FY22-23 Work Plan'!$H$29:$H$29),\"\",'FY22-23 Work Plan'!$H$29:$H$29)","v":""},{"$f":"IF(ISBLANK('FY22-23 Work Plan'!$B$30:$B$30),\"\",'FY22-23 Work Plan'!$B$30:$B$30)","v":""},{"$f":"IF(ISBLANK('FY22-23 Work Plan'!$D$30:$D$30),\"\",'FY22-23 Work Plan'!$D$30:$D$30)","v":""},{"$f":"IF(ISBLANK('FY22-23 Work Plan'!$H$30:$H$30),\"\",'FY22-23 Work Plan'!$H$30:$H$30)","v":""},{"$f":"IF(ISBLANK('FY22-23 Work Plan'!$B$31:$B$31),\"\",'FY22-23 Work Plan'!$B$31:$B$31)","v":""},{"$f":"IF(ISBLANK('FY22-23 Work Plan'!$D$31:$D$31),\"\",'FY22-23 Work Plan'!$D$31:$D$31)","v":""},{"$f":"IF(ISBLANK('FY22-23 Work Plan'!$H$31:$H$31),\"\",'FY22-23 Work Plan'!$H$31:$H$31)","v":""},{"$f":"IF(ISBLANK('FY22-23 Work Plan'!$B$32:$B$32),\"\",'FY22-23 Work Plan'!$B$32:$B$32)","v":""},{"$f":"IF(ISBLANK('FY22-23 Work Plan'!$D$32:$D$32),\"\",'FY22-23 Work Plan'!$D$32:$D$32)","v":""},{"$f":"IF(ISBLANK('FY22-23 Work Plan'!$H$32:$H$32),\"\",'FY22-23 Work Plan'!$H$32:$H$32)","v":""},{"$f":"IF(ISBLANK('FY22-23 Work Plan'!A69),\"\",'FY22-23 Work Plan'!A69)","v":""},{"$f":"IF(ISBLANK('FY22-23 Work Plan'!D69),\"\",'FY22-23 Work Plan'!D69)","v":""},{"$f":"IF(ISBLANK('FY22-23 Work Plan'!E69),\"\",'FY22-23 Work Plan'!E69)","v":""},{"$f":"IF(ISBLANK('FY22-23 Work Plan'!F69),\"\",'FY22-23 Work Plan'!F69)","v":""},{"$f":"IF(ISBLANK('FY22-23 Work Plan'!H69),\"\",'FY22-23 Work Plan'!H69)","v":""},{"$f":"IF(ISBLANK('FY22-23 Work Plan'!I69),\"\",'FY22-23 Work Plan'!I69)","v":""},{"$f":"IF(ISBLANK('FY22-23 Work Plan'!J69),\"\",'FY22-23 Work Plan'!J69)","v":""},{"$f":"IF(ISBLANK('FY22-23 Work Plan'!K69),\"\",'FY22-23 Work Plan'!K69)","v":""},{"$f":"IF(ISBLANK('FY22-23 Work Plan'!L69),\"\",'FY22-23 Work Plan'!L69)","v":""}]
[{"$f":"IF(ISBLANK('FY22-23 Work Plan'!$E$2:$E$2),\"\",'FY22-23 Work Plan'!$E$2:$E$2)","v":"Asian American Drug Abuse Programs, Inc. (AADAP)"},{"$f":"IF(ISBLANK('FY22-23 Work Plan'!$J$2:$J$2),\"\",'FY22-23 Work Plan'!$J$2:$J$2)","v":"Prevention Education Program (PEP)"},{"$f":"IF(ISBLANK('FY22-23 Work Plan'!$J$3:$J$3),\"\",'FY22-23 Work Plan'!$J$3:$J$3)","v":""},{"$f":"IF(ISBLANK('FY22-23 Work Plan'!$E$3:$E$3),\"\",'FY22-23 Work Plan'!$E$3:$E$3)","v":"PH-004367"},{"$f":"IF(ISBLANK('FY22-23 Work Plan'!$E$4:$E$4),\"\",TEXT('FY22-23 Work Plan'!$E$4:$E$4,\"000000\"))","v":"000001"},{"$f":"IF(ISBLANK('FY22-23 Work Plan'!$J$4:$J$4),\"\",'FY22-23 Work Plan'!$J$4:$J$4)","v":"Building Skills"},{"$f":"IF(ISBLANK('FY22-23 Work Plan'!$E$5:$E$5),\"\",'FY22-23 Work Plan'!$E$5:$E$5)","v":"2 - San Fernando Valley"},{"$f":"IF(ISBLANK('FY22-23 Work Plan'!$J$5:$J$5),\"\",'FY22-23 Work Plan'!$J$5:$J$5)","v":"3rd District, 4th District"},{"$f":"IF(ISBLANK('FY22-23 Work Plan'!$E$6:$E$6),\"\",'FY22-23 Work Plan'!$E$6:$E$6)","v":"Angeles National Forest*, Artesia, Altadena*"},{"$f":"IF(ISBLANK('FY22-23 Work Plan'!$E$7:$E$7),\"\",'FY22-23 Work Plan'!$E$7:$E$7)","v":"Cadillac-Corning, Angeles National Forest"},{"$f":"IF(ISBLANK('FY22-23 Work Plan'!$E$8:$E$8),\"\",'FY22-23 Work Plan'!$E$8:$E$8)","v":"90032, 90036"},{"$f":"IF(ISBLANK('FY22-23 Work Plan'!$E$9:$E$9),\"\",'FY22-23 Work Plan'!$E$9:$E$9)","v":"123 E Main St., Suite 100 \nAnytown, CA 90000"},{"$f":"IF(ISBLANK('FY22-23 Work Plan'!$J$9:$J$9),\"\",TEXT('FY22-23 Work Plan'!$J$9:$J$9,\"###-###-####\"))","v":"999-999-9999"},{"$f":"IF(ISBLANK('FY22-23 Work Plan'!$J$10:$J$10),\"\",'FY22-23 Work Plan'!$J$10:$J$10)","v":"www.abc1.org"},{"$f":"IF(ISBLANK('FY22-23 Work Plan'!$E$11:$E$11),\"\",'FY22-23 Work Plan'!$E$11:$E$11)","v":"123 E Main St., Suite 100 \nAnytown, CA 90000"},{"$f":"IF(ISBLANK('FY22-23 Work Plan'!$J$11:$J$11),\"\",TEXT('FY22-23 Work Plan'!$J$11:$J$11,\"###-###-####\"))","v":"999-999-9999"},{"$f":"IF(ISBLANK('FY22-23 Work Plan'!$J$12:$J$12),\"\",'FY22-23 Work Plan'!$J$12:$J$12)","v":"www.abc2.org"},{"$f":"IF(ISBLANK('FY22-23 Work Plan'!$E$15:$E$15),\"\",'FY22-23 Work Plan'!$E$15:$E$15)","v":"John/Jane Doe"},{"$f":"IF(ISBLANK('FY22-23 Work Plan'!$H$15:$H$15),\"\",TEXT('FY22-23 Work Plan'!$H$15:$H$15,\"###-###-####\"))","v":"213-555-1212"},{"$f":"IF(ISBLANK('FY22-23 Work Plan'!$J$15:$J$15),\"\",'FY22-23 Work Plan'!$J$15:$J$15)","v":"janedoe@preventionusa.com"},{"$f":"IF(ISBLANK('FY22-23 Work Plan'!$E$16:$E$16),\"\",'FY22-23 Work Plan'!$E$16:$E$16)","v":"John/Jane Doe"},{"$f":"IF(ISBLANK('FY22-23 Work Plan'!$H$16:$H$16),\"\",TEXT('FY22-23 Work Plan'!$H$16:$H$16,\"###-###-####\"))","v":"213-555-1212"},{"$f":"IF(ISBLANK('FY22-23 Work Plan'!$J$16:$J$16),\"\",'FY22-23 Work Plan'!$J$16:$J$16)","v":"janedoe@preventionusa.com"},{"$f":"IF(ISBLANK('FY22-23 Work Plan'!$E$17:$E$17),\"\",'FY22-23 Work Plan'!$E$17:$E$17)","v":"John/Jane Doe"},{"$f":"IF(ISBLANK('FY22-23 Work Plan'!$H$17:$H$17),\"\",TEXT('FY22-23 Work Plan'!$H$17:$H$17,\"###-###-####\"))","v":"213-555-1212"},{"$f":"IF(ISBLANK('FY22-23 Work Plan'!$J$17:$J$17),\"\",'FY22-23 Work Plan'!$J$17:$J$17)","v":"j.doe@preventionusa.com"},{"$f":"IF(ISBLANK('FY22-23 Work Plan'!$E$18:$E$18),\"\",'FY22-23 Work Plan'!$E$18:$E$18)","v":"John/Jane Doe"},{"$f":"IF(ISBLANK('FY22-23 Work Plan'!$H$18:$H$18),\"\",TEXT('FY22-23 Work Plan'!$H$18:$H$18,\"###-###-####\"))","v":"213-555-1213"},{"$f":"IF(ISBLANK('FY22-23 Work Plan'!$J$18:$J$18),\"\",'FY22-23 Work Plan'!$J$18:$J$18)","v":"j.doe@preventionusa.com"},{"$f":"IF(ISBLANK('FY22-23 Work Plan'!$E$19:$E$19),\"\",'FY22-23 Work Plan'!$E$19:$E$19)","v":"John/Jane Doe"},{"$f":"IF(ISBLANK('FY22-23 Work Plan'!$H$19:$H$19),\"\",TEXT('FY22-23 Work Plan'!$H$19:$H$19,\"###-###-####\"))","v":"213-555-1213"},{"$f":"IF(ISBLANK('FY22-23 Work Plan'!$J$19:$J$19),\"\",'FY22-23 Work Plan'!$J$19:$J$19)","v":"j.doe@preventionusa.com"},{"$f":"IF(ISBLANK('FY22-23 Work Plan'!$D$23:$D$23),\"\",'FY22-23 Work Plan'!$D$23:$D$23)","v":""},{"$f":"IF(ISBLANK('FY22-23 Work Plan'!$H$23:$H$23),\"\",'FY22-23 Work Plan'!$H$23:$H$23)","v":""},{"$f":"IF(ISBLANK('FY22-23 Work Plan'!$D$24:$D$24),\"\",'FY22-23 Work Plan'!$D$24:$D$24)","v":""},{"$f":"IF(ISBLANK('FY22-23 Work Plan'!$H$24:$H$24),\"\",'FY22-23 Work Plan'!$H$24:$H$24)","v":""},{"$f":"IF(ISBLANK('FY22-23 Work Plan'!$D$25:$D$25),\"\",'FY22-23 Work Plan'!$D$25:$D$25)","v":""},{"$f":"IF(ISBLANK('FY22-23 Work Plan'!$H$25:$H$25),\"\",'FY22-23 Work Plan'!$H$25:$H$25)","v":""},{"$f":"IF(ISBLANK('FY22-23 Work Plan'!$D$26:$D$26),\"\",'FY22-23 Work Plan'!$D$26:$D$26)","v":""},{"$f":"IF(ISBLANK('FY22-23 Work Plan'!$H$26:$H$26),\"\",'FY22-23 Work Plan'!$H$26:$H$26)","v":""},{"$f":"IF(ISBLANK('FY22-23 Work Plan'!$D$27:$D$27),\"\",'FY22-23 Work Plan'!$D$27:$D$27)","v":""},{"$f":"IF(ISBLANK('FY22-23 Work Plan'!$H$27:$H$27),\"\",'FY22-23 Work Plan'!$H$27:$H$27)","v":""},{"$f":"IF(ISBLANK('FY22-23 Work Plan'!$D$28:$D$28),\"\",'FY22-23 Work Plan'!$D$28:$D$28)","v":""},{"$f":"IF(ISBLANK('FY22-23 Work Plan'!$H$28:$H$28),\"\",'FY22-23 Work Plan'!$H$28:$H$28)","v":""},{"$f":"IF(ISBLANK('FY22-23 Work Plan'!$D$29:$D$29),\"\",'FY22-23 Work Plan'!$D$29:$D$29)","v":""},{"$f":"IF(ISBLANK('FY22-23 Work Plan'!$H$29:$H$29),\"\",'FY22-23 Work Plan'!$H$29:$H$29)","v":""},{"$f":"IF(ISBLANK('FY22-23 Work Plan'!$B$30:$B$30),\"\",'FY22-23 Work Plan'!$B$30:$B$30)","v":""},{"$f":"IF(ISBLANK('FY22-23 Work Plan'!$D$30:$D$30),\"\",'FY22-23 Work Plan'!$D$30:$D$30)","v":""},{"$f":"IF(ISBLANK('FY22-23 Work Plan'!$H$30:$H$30),\"\",'FY22-23 Work Plan'!$H$30:$H$30)","v":""},{"$f":"IF(ISBLANK('FY22-23 Work Plan'!$B$31:$B$31),\"\",'FY22-23 Work Plan'!$B$31:$B$31)","v":""},{"$f":"IF(ISBLANK('FY22-23 Work Plan'!$D$31:$D$31),\"\",'FY22-23 Work Plan'!$D$31:$D$31)","v":""},{"$f":"IF(ISBLANK('FY22-23 Work Plan'!$H$31:$H$31),\"\",'FY22-23 Work Plan'!$H$31:$H$31)","v":""},{"$f":"IF(ISBLANK('FY22-23 Work Plan'!$B$32:$B$32),\"\",'FY22-23 Work Plan'!$B$32:$B$32)","v":""},{"$f":"IF(ISBLANK('FY22-23 Work Plan'!$D$32:$D$32),\"\",'FY22-23 Work Plan'!$D$32:$D$32)","v":""},{"$f":"IF(ISBLANK('FY22-23 Work Plan'!$H$32:$H$32),\"\",'FY22-23 Work Plan'!$H$32:$H$32)","v":""},{"$f":"IF(ISBLANK('FY22-23 Work Plan'!A70),\"\",'FY22-23 Work Plan'!A70)","v":""},{"$f":"IF(ISBLANK('FY22-23 Work Plan'!D70),\"\",'FY22-23 Work Plan'!D70)","v":""},{"$f":"IF(ISBLANK('FY22-23 Work Plan'!E70),\"\",'FY22-23 Work Plan'!E70)","v":""},{"$f":"IF(ISBLANK('FY22-23 Work Plan'!F70),\"\",'FY22-23 Work Plan'!F70)","v":""},{"$f":"IF(ISBLANK('FY22-23 Work Plan'!H70),\"\",'FY22-23 Work Plan'!H70)","v":""},{"$f":"IF(ISBLANK('FY22-23 Work Plan'!I70),\"\",'FY22-23 Work Plan'!I70)","v":""},{"$f":"IF(ISBLANK('FY22-23 Work Plan'!J70),\"\",'FY22-23 Work Plan'!J70)","v":""},{"$f":"IF(ISBLANK('FY22-23 Work Plan'!K70),\"\",'FY22-23 Work Plan'!K70)","v":""},{"$f":"IF(ISBLANK('FY22-23 Work Plan'!L70),\"\",'FY22-23 Work Plan'!L70)","v":""}]
[{"$f":"IF(ISBLANK('FY22-23 Work Plan'!$E$2:$E$2),\"\",'FY22-23 Work Plan'!$E$2:$E$2)","v":"Asian American Drug Abuse Programs, Inc. (AADAP)"},{"$f":"IF(ISBLANK('FY22-23 Work Plan'!$J$2:$J$2),\"\",'FY22-23 Work Plan'!$J$2:$J$2)","v":"Prevention Education Program (PEP)"},{"$f":"IF(ISBLANK('FY22-23 Work Plan'!$J$3:$J$3),\"\",'FY22-23 Work Plan'!$J$3:$J$3)","v":""},{"$f":"IF(ISBLANK('FY22-23 Work Plan'!$E$3:$E$3),\"\",'FY22-23 Work Plan'!$E$3:$E$3)","v":"PH-004367"},{"$f":"IF(ISBLANK('FY22-23 Work Plan'!$E$4:$E$4),\"\",TEXT('FY22-23 Work Plan'!$E$4:$E$4,\"000000\"))","v":"000001"},{"$f":"IF(ISBLANK('FY22-23 Work Plan'!$J$4:$J$4),\"\",'FY22-23 Work Plan'!$J$4:$J$4)","v":"Building Skills"},{"$f":"IF(ISBLANK('FY22-23 Work Plan'!$E$5:$E$5),\"\",'FY22-23 Work Plan'!$E$5:$E$5)","v":"2 - San Fernando Valley"},{"$f":"IF(ISBLANK('FY22-23 Work Plan'!$J$5:$J$5),\"\",'FY22-23 Work Plan'!$J$5:$J$5)","v":"3rd District, 4th District"},{"$f":"IF(ISBLANK('FY22-23 Work Plan'!$E$6:$E$6),\"\",'FY22-23 Work Plan'!$E$6:$E$6)","v":"Angeles National Forest*, Artesia, Altadena*"},{"$f":"IF(ISBLANK('FY22-23 Work Plan'!$E$7:$E$7),\"\",'FY22-23 Work Plan'!$E$7:$E$7)","v":"Cadillac-Corning, Angeles National Forest"},{"$f":"IF(ISBLANK('FY22-23 Work Plan'!$E$8:$E$8),\"\",'FY22-23 Work Plan'!$E$8:$E$8)","v":"90032, 90036"},{"$f":"IF(ISBLANK('FY22-23 Work Plan'!$E$9:$E$9),\"\",'FY22-23 Work Plan'!$E$9:$E$9)","v":"123 E Main St., Suite 100 \nAnytown, CA 90000"},{"$f":"IF(ISBLANK('FY22-23 Work Plan'!$J$9:$J$9),\"\",TEXT('FY22-23 Work Plan'!$J$9:$J$9,\"###-###-####\"))","v":"999-999-9999"},{"$f":"IF(ISBLANK('FY22-23 Work Plan'!$J$10:$J$10),\"\",'FY22-23 Work Plan'!$J$10:$J$10)","v":"www.abc1.org"},{"$f":"IF(ISBLANK('FY22-23 Work Plan'!$E$11:$E$11),\"\",'FY22-23 Work Plan'!$E$11:$E$11)","v":"123 E Main St., Suite 100 \nAnytown, CA 90000"},{"$f":"IF(ISBLANK('FY22-23 Work Plan'!$J$11:$J$11),\"\",TEXT('FY22-23 Work Plan'!$J$11:$J$11,\"###-###-####\"))","v":"999-999-9999"},{"$f":"IF(ISBLANK('FY22-23 Work Plan'!$J$12:$J$12),\"\",'FY22-23 Work Plan'!$J$12:$J$12)","v":"www.abc2.org"},{"$f":"IF(ISBLANK('FY22-23 Work Plan'!$E$15:$E$15),\"\",'FY22-23 Work Plan'!$E$15:$E$15)","v":"John/Jane Doe"},{"$f":"IF(ISBLANK('FY22-23 Work Plan'!$H$15:$H$15),\"\",TEXT('FY22-23 Work Plan'!$H$15:$H$15,\"###-###-####\"))","v":"213-555-1212"},{"$f":"IF(ISBLANK('FY22-23 Work Plan'!$J$15:$J$15),\"\",'FY22-23 Work Plan'!$J$15:$J$15)","v":"janedoe@preventionusa.com"},{"$f":"IF(ISBLANK('FY22-23 Work Plan'!$E$16:$E$16),\"\",'FY22-23 Work Plan'!$E$16:$E$16)","v":"John/Jane Doe"},{"$f":"IF(ISBLANK('FY22-23 Work Plan'!$H$16:$H$16),\"\",TEXT('FY22-23 Work Plan'!$H$16:$H$16,\"###-###-####\"))","v":"213-555-1212"},{"$f":"IF(ISBLANK('FY22-23 Work Plan'!$J$16:$J$16),\"\",'FY22-23 Work Plan'!$J$16:$J$16)","v":"janedoe@preventionusa.com"},{"$f":"IF(ISBLANK('FY22-23 Work Plan'!$E$17:$E$17),\"\",'FY22-23 Work Plan'!$E$17:$E$17)","v":"John/Jane Doe"},{"$f":"IF(ISBLANK('FY22-23 Work Plan'!$H$17:$H$17),\"\",TEXT('FY22-23 Work Plan'!$H$17:$H$17,\"###-###-####\"))","v":"213-555-1212"},{"$f":"IF(ISBLANK('FY22-23 Work Plan'!$J$17:$J$17),\"\",'FY22-23 Work Plan'!$J$17:$J$17)","v":"j.doe@preventionusa.com"},{"$f":"IF(ISBLANK('FY22-23 Work Plan'!$E$18:$E$18),\"\",'FY22-23 Work Plan'!$E$18:$E$18)","v":"John/Jane Doe"},{"$f":"IF(ISBLANK('FY22-23 Work Plan'!$H$18:$H$18),\"\",TEXT('FY22-23 Work Plan'!$H$18:$H$18,\"###-###-####\"))","v":"213-555-1213"},{"$f":"IF(ISBLANK('FY22-23 Work Plan'!$J$18:$J$18),\"\",'FY22-23 Work Plan'!$J$18:$J$18)","v":"j.doe@preventionusa.com"},{"$f":"IF(ISBLANK('FY22-23 Work Plan'!$E$19:$E$19),\"\",'FY22-23 Work Plan'!$E$19:$E$19)","v":"John/Jane Doe"},{"$f":"IF(ISBLANK('FY22-23 Work Plan'!$H$19:$H$19),\"\",TEXT('FY22-23 Work Plan'!$H$19:$H$19,\"###-###-####\"))","v":"213-555-1213"},{"$f":"IF(ISBLANK('FY22-23 Work Plan'!$J$19:$J$19),\"\",'FY22-23 Work Plan'!$J$19:$J$19)","v":"j.doe@preventionusa.com"},{"$f":"IF(ISBLANK('FY22-23 Work Plan'!$D$23:$D$23),\"\",'FY22-23 Work Plan'!$D$23:$D$23)","v":""},{"$f":"IF(ISBLANK('FY22-23 Work Plan'!$H$23:$H$23),\"\",'FY22-23 Work Plan'!$H$23:$H$23)","v":""},{"$f":"IF(ISBLANK('FY22-23 Work Plan'!$D$24:$D$24),\"\",'FY22-23 Work Plan'!$D$24:$D$24)","v":""},{"$f":"IF(ISBLANK('FY22-23 Work Plan'!$H$24:$H$24),\"\",'FY22-23 Work Plan'!$H$24:$H$24)","v":""},{"$f":"IF(ISBLANK('FY22-23 Work Plan'!$D$25:$D$25),\"\",'FY22-23 Work Plan'!$D$25:$D$25)","v":""},{"$f":"IF(ISBLANK('FY22-23 Work Plan'!$H$25:$H$25),\"\",'FY22-23 Work Plan'!$H$25:$H$25)","v":""},{"$f":"IF(ISBLANK('FY22-23 Work Plan'!$D$26:$D$26),\"\",'FY22-23 Work Plan'!$D$26:$D$26)","v":""},{"$f":"IF(ISBLANK('FY22-23 Work Plan'!$H$26:$H$26),\"\",'FY22-23 Work Plan'!$H$26:$H$26)","v":""},{"$f":"IF(ISBLANK('FY22-23 Work Plan'!$D$27:$D$27),\"\",'FY22-23 Work Plan'!$D$27:$D$27)","v":""},{"$f":"IF(ISBLANK('FY22-23 Work Plan'!$H$27:$H$27),\"\",'FY22-23 Work Plan'!$H$27:$H$27)","v":""},{"$f":"IF(ISBLANK('FY22-23 Work Plan'!$D$28:$D$28),\"\",'FY22-23 Work Plan'!$D$28:$D$28)","v":""},{"$f":"IF(ISBLANK('FY22-23 Work Plan'!$H$28:$H$28),\"\",'FY22-23 Work Plan'!$H$28:$H$28)","v":""},{"$f":"IF(ISBLANK('FY22-23 Work Plan'!$D$29:$D$29),\"\",'FY22-23 Work Plan'!$D$29:$D$29)","v":""},{"$f":"IF(ISBLANK('FY22-23 Work Plan'!$H$29:$H$29),\"\",'FY22-23 Work Plan'!$H$29:$H$29)","v":""},{"$f":"IF(ISBLANK('FY22-23 Work Plan'!$B$30:$B$30),\"\",'FY22-23 Work Plan'!$B$30:$B$30)","v":""},{"$f":"IF(ISBLANK('FY22-23 Work Plan'!$D$30:$D$30),\"\",'FY22-23 Work Plan'!$D$30:$D$30)","v":""},{"$f":"IF(ISBLANK('FY22-23 Work Plan'!$H$30:$H$30),\"\",'FY22-23 Work Plan'!$H$30:$H$30)","v":""},{"$f":"IF(ISBLANK('FY22-23 Work Plan'!$B$31:$B$31),\"\",'FY22-23 Work Plan'!$B$31:$B$31)","v":""},{"$f":"IF(ISBLANK('FY22-23 Work Plan'!$D$31:$D$31),\"\",'FY22-23 Work Plan'!$D$31:$D$31)","v":""},{"$f":"IF(ISBLANK('FY22-23 Work Plan'!$H$31:$H$31),\"\",'FY22-23 Work Plan'!$H$31:$H$31)","v":""},{"$f":"IF(ISBLANK('FY22-23 Work Plan'!$B$32:$B$32),\"\",'FY22-23 Work Plan'!$B$32:$B$32)","v":""},{"$f":"IF(ISBLANK('FY22-23 Work Plan'!$D$32:$D$32),\"\",'FY22-23 Work Plan'!$D$32:$D$32)","v":""},{"$f":"IF(ISBLANK('FY22-23 Work Plan'!$H$32:$H$32),\"\",'FY22-23 Work Plan'!$H$32:$H$32)","v":""},{"$f":"IF(ISBLANK('FY22-23 Work Plan'!A71),\"\",'FY22-23 Work Plan'!A71)","v":""},{"$f":"IF(ISBLANK('FY22-23 Work Plan'!D71),\"\",'FY22-23 Work Plan'!D71)","v":""},{"$f":"IF(ISBLANK('FY22-23 Work Plan'!E71),\"\",'FY22-23 Work Plan'!E71)","v":""},{"$f":"IF(ISBLANK('FY22-23 Work Plan'!F71),\"\",'FY22-23 Work Plan'!F71)","v":""},{"$f":"IF(ISBLANK('FY22-23 Work Plan'!H71),\"\",'FY22-23 Work Plan'!H71)","v":""},{"$f":"IF(ISBLANK('FY22-23 Work Plan'!I71),\"\",'FY22-23 Work Plan'!I71)","v":""},{"$f":"IF(ISBLANK('FY22-23 Work Plan'!J71),\"\",'FY22-23 Work Plan'!J71)","v":""},{"$f":"IF(ISBLANK('FY22-23 Work Plan'!K71),\"\",'FY22-23 Work Plan'!K71)","v":""},{"$f":"IF(ISBLANK('FY22-23 Work Plan'!L71),\"\",'FY22-23 Work Plan'!L71)","v":""}]
[{"$f":"IF(ISBLANK('FY22-23 Work Plan'!$E$2:$E$2),\"\",'FY22-23 Work Plan'!$E$2:$E$2)","v":"Asian American Drug Abuse Programs, Inc. (AADAP)"},{"$f":"IF(ISBLANK('FY22-23 Work Plan'!$J$2:$J$2),\"\",'FY22-23 Work Plan'!$J$2:$J$2)","v":"Prevention Education Program (PEP)"},{"$f":"IF(ISBLANK('FY22-23 Work Plan'!$J$3:$J$3),\"\",'FY22-23 Work Plan'!$J$3:$J$3)","v":""},{"$f":"IF(ISBLANK('FY22-23 Work Plan'!$E$3:$E$3),\"\",'FY22-23 Work Plan'!$E$3:$E$3)","v":"PH-004367"},{"$f":"IF(ISBLANK('FY22-23 Work Plan'!$E$4:$E$4),\"\",TEXT('FY22-23 Work Plan'!$E$4:$E$4,\"000000\"))","v":"000001"},{"$f":"IF(ISBLANK('FY22-23 Work Plan'!$J$4:$J$4),\"\",'FY22-23 Work Plan'!$J$4:$J$4)","v":"Building Skills"},{"$f":"IF(ISBLANK('FY22-23 Work Plan'!$E$5:$E$5),\"\",'FY22-23 Work Plan'!$E$5:$E$5)","v":"2 - San Fernando Valley"},{"$f":"IF(ISBLANK('FY22-23 Work Plan'!$J$5:$J$5),\"\",'FY22-23 Work Plan'!$J$5:$J$5)","v":"3rd District, 4th District"},{"$f":"IF(ISBLANK('FY22-23 Work Plan'!$E$6:$E$6),\"\",'FY22-23 Work Plan'!$E$6:$E$6)","v":"Angeles National Forest*, Artesia, Altadena*"},{"$f":"IF(ISBLANK('FY22-23 Work Plan'!$E$7:$E$7),\"\",'FY22-23 Work Plan'!$E$7:$E$7)","v":"Cadillac-Corning, Angeles National Forest"},{"$f":"IF(ISBLANK('FY22-23 Work Plan'!$E$8:$E$8),\"\",'FY22-23 Work Plan'!$E$8:$E$8)","v":"90032, 90036"},{"$f":"IF(ISBLANK('FY22-23 Work Plan'!$E$9:$E$9),\"\",'FY22-23 Work Plan'!$E$9:$E$9)","v":"123 E Main St., Suite 100 \nAnytown, CA 90000"},{"$f":"IF(ISBLANK('FY22-23 Work Plan'!$J$9:$J$9),\"\",TEXT('FY22-23 Work Plan'!$J$9:$J$9,\"###-###-####\"))","v":"999-999-9999"},{"$f":"IF(ISBLANK('FY22-23 Work Plan'!$J$10:$J$10),\"\",'FY22-23 Work Plan'!$J$10:$J$10)","v":"www.abc1.org"},{"$f":"IF(ISBLANK('FY22-23 Work Plan'!$E$11:$E$11),\"\",'FY22-23 Work Plan'!$E$11:$E$11)","v":"123 E Main St., Suite 100 \nAnytown, CA 90000"},{"$f":"IF(ISBLANK('FY22-23 Work Plan'!$J$11:$J$11),\"\",TEXT('FY22-23 Work Plan'!$J$11:$J$11,\"###-###-####\"))","v":"999-999-9999"},{"$f":"IF(ISBLANK('FY22-23 Work Plan'!$J$12:$J$12),\"\",'FY22-23 Work Plan'!$J$12:$J$12)","v":"www.abc2.org"},{"$f":"IF(ISBLANK('FY22-23 Work Plan'!$E$15:$E$15),\"\",'FY22-23 Work Plan'!$E$15:$E$15)","v":"John/Jane Doe"},{"$f":"IF(ISBLANK('FY22-23 Work Plan'!$H$15:$H$15),\"\",TEXT('FY22-23 Work Plan'!$H$15:$H$15,\"###-###-####\"))","v":"213-555-1212"},{"$f":"IF(ISBLANK('FY22-23 Work Plan'!$J$15:$J$15),\"\",'FY22-23 Work Plan'!$J$15:$J$15)","v":"janedoe@preventionusa.com"},{"$f":"IF(ISBLANK('FY22-23 Work Plan'!$E$16:$E$16),\"\",'FY22-23 Work Plan'!$E$16:$E$16)","v":"John/Jane Doe"},{"$f":"IF(ISBLANK('FY22-23 Work Plan'!$H$16:$H$16),\"\",TEXT('FY22-23 Work Plan'!$H$16:$H$16,\"###-###-####\"))","v":"213-555-1212"},{"$f":"IF(ISBLANK('FY22-23 Work Plan'!$J$16:$J$16),\"\",'FY22-23 Work Plan'!$J$16:$J$16)","v":"janedoe@preventionusa.com"},{"$f":"IF(ISBLANK('FY22-23 Work Plan'!$E$17:$E$17),\"\",'FY22-23 Work Plan'!$E$17:$E$17)","v":"John/Jane Doe"},{"$f":"IF(ISBLANK('FY22-23 Work Plan'!$H$17:$H$17),\"\",TEXT('FY22-23 Work Plan'!$H$17:$H$17,\"###-###-####\"))","v":"213-555-1212"},{"$f":"IF(ISBLANK('FY22-23 Work Plan'!$J$17:$J$17),\"\",'FY22-23 Work Plan'!$J$17:$J$17)","v":"j.doe@preventionusa.com"},{"$f":"IF(ISBLANK('FY22-23 Work Plan'!$E$18:$E$18),\"\",'FY22-23 Work Plan'!$E$18:$E$18)","v":"John/Jane Doe"},{"$f":"IF(ISBLANK('FY22-23 Work Plan'!$H$18:$H$18),\"\",TEXT('FY22-23 Work Plan'!$H$18:$H$18,\"###-###-####\"))","v":"213-555-1213"},{"$f":"IF(ISBLANK('FY22-23 Work Plan'!$J$18:$J$18),\"\",'FY22-23 Work Plan'!$J$18:$J$18)","v":"j.doe@preventionusa.com"},{"$f":"IF(ISBLANK('FY22-23 Work Plan'!$E$19:$E$19),\"\",'FY22-23 Work Plan'!$E$19:$E$19)","v":"John/Jane Doe"},{"$f":"IF(ISBLANK('FY22-23 Work Plan'!$H$19:$H$19),\"\",TEXT('FY22-23 Work Plan'!$H$19:$H$19,\"###-###-####\"))","v":"213-555-1213"},{"$f":"IF(ISBLANK('FY22-23 Work Plan'!$J$19:$J$19),\"\",'FY22-23 Work Plan'!$J$19:$J$19)","v":"j.doe@preventionusa.com"},{"$f":"IF(ISBLANK('FY22-23 Work Plan'!$D$23:$D$23),\"\",'FY22-23 Work Plan'!$D$23:$D$23)","v":""},{"$f":"IF(ISBLANK('FY22-23 Work Plan'!$H$23:$H$23),\"\",'FY22-23 Work Plan'!$H$23:$H$23)","v":""},{"$f":"IF(ISBLANK('FY22-23 Work Plan'!$D$24:$D$24),\"\",'FY22-23 Work Plan'!$D$24:$D$24)","v":""},{"$f":"IF(ISBLANK('FY22-23 Work Plan'!$H$24:$H$24),\"\",'FY22-23 Work Plan'!$H$24:$H$24)","v":""},{"$f":"IF(ISBLANK('FY22-23 Work Plan'!$D$25:$D$25),\"\",'FY22-23 Work Plan'!$D$25:$D$25)","v":""},{"$f":"IF(ISBLANK('FY22-23 Work Plan'!$H$25:$H$25),\"\",'FY22-23 Work Plan'!$H$25:$H$25)","v":""},{"$f":"IF(ISBLANK('FY22-23 Work Plan'!$D$26:$D$26),\"\",'FY22-23 Work Plan'!$D$26:$D$26)","v":""},{"$f":"IF(ISBLANK('FY22-23 Work Plan'!$H$26:$H$26),\"\",'FY22-23 Work Plan'!$H$26:$H$26)","v":""},{"$f":"IF(ISBLANK('FY22-23 Work Plan'!$D$27:$D$27),\"\",'FY22-23 Work Plan'!$D$27:$D$27)","v":""},{"$f":"IF(ISBLANK('FY22-23 Work Plan'!$H$27:$H$27),\"\",'FY22-23 Work Plan'!$H$27:$H$27)","v":""},{"$f":"IF(ISBLANK('FY22-23 Work Plan'!$D$28:$D$28),\"\",'FY22-23 Work Plan'!$D$28:$D$28)","v":""},{"$f":"IF(ISBLANK('FY22-23 Work Plan'!$H$28:$H$28),\"\",'FY22-23 Work Plan'!$H$28:$H$28)","v":""},{"$f":"IF(ISBLANK('FY22-23 Work Plan'!$D$29:$D$29),\"\",'FY22-23 Work Plan'!$D$29:$D$29)","v":""},{"$f":"IF(ISBLANK('FY22-23 Work Plan'!$H$29:$H$29),\"\",'FY22-23 Work Plan'!$H$29:$H$29)","v":""},{"$f":"IF(ISBLANK('FY22-23 Work Plan'!$B$30:$B$30),\"\",'FY22-23 Work Plan'!$B$30:$B$30)","v":""},{"$f":"IF(ISBLANK('FY22-23 Work Plan'!$D$30:$D$30),\"\",'FY22-23 Work Plan'!$D$30:$D$30)","v":""},{"$f":"IF(ISBLANK('FY22-23 Work Plan'!$H$30:$H$30),\"\",'FY22-23 Work Plan'!$H$30:$H$30)","v":""},{"$f":"IF(ISBLANK('FY22-23 Work Plan'!$B$31:$B$31),\"\",'FY22-23 Work Plan'!$B$31:$B$31)","v":""},{"$f":"IF(ISBLANK('FY22-23 Work Plan'!$D$31:$D$31),\"\",'FY22-23 Work Plan'!$D$31:$D$31)","v":""},{"$f":"IF(ISBLANK('FY22-23 Work Plan'!$H$31:$H$31),\"\",'FY22-23 Work Plan'!$H$31:$H$31)","v":""},{"$f":"IF(ISBLANK('FY22-23 Work Plan'!$B$32:$B$32),\"\",'FY22-23 Work Plan'!$B$32:$B$32)","v":""},{"$f":"IF(ISBLANK('FY22-23 Work Plan'!$D$32:$D$32),\"\",'FY22-23 Work Plan'!$D$32:$D$32)","v":""},{"$f":"IF(ISBLANK('FY22-23 Work Plan'!$H$32:$H$32),\"\",'FY22-23 Work Plan'!$H$32:$H$32)","v":""},{"$f":"IF(ISBLANK('FY22-23 Work Plan'!A72),\"\",'FY22-23 Work Plan'!A72)","v":""},{"$f":"IF(ISBLANK('FY22-23 Work Plan'!D72),\"\",'FY22-23 Work Plan'!D72)","v":""},{"$f":"IF(ISBLANK('FY22-23 Work Plan'!E72),\"\",'FY22-23 Work Plan'!E72)","v":""},{"$f":"IF(ISBLANK('FY22-23 Work Plan'!F72),\"\",'FY22-23 Work Plan'!F72)","v":""},{"$f":"IF(ISBLANK('FY22-23 Work Plan'!H72),\"\",'FY22-23 Work Plan'!H72)","v":""},{"$f":"IF(ISBLANK('FY22-23 Work Plan'!I72),\"\",'FY22-23 Work Plan'!I72)","v":""},{"$f":"IF(ISBLANK('FY22-23 Work Plan'!J72),\"\",'FY22-23 Work Plan'!J72)","v":""},{"$f":"IF(ISBLANK('FY22-23 Work Plan'!K72),\"\",'FY22-23 Work Plan'!K72)","v":""},{"$f":"IF(ISBLANK('FY22-23 Work Plan'!L72),\"\",'FY22-23 Work Plan'!L72)","v":""}]
[{"$f":"IF(ISBLANK('FY22-23 Work Plan'!$E$2:$E$2),\"\",'FY22-23 Work Plan'!$E$2:$E$2)","v":"Asian American Drug Abuse Programs, Inc. (AADAP)"},{"$f":"IF(ISBLANK('FY22-23 Work Plan'!$J$2:$J$2),\"\",'FY22-23 Work Plan'!$J$2:$J$2)","v":"Prevention Education Program (PEP)"},{"$f":"IF(ISBLANK('FY22-23 Work Plan'!$J$3:$J$3),\"\",'FY22-23 Work Plan'!$J$3:$J$3)","v":""},{"$f":"IF(ISBLANK('FY22-23 Work Plan'!$E$3:$E$3),\"\",'FY22-23 Work Plan'!$E$3:$E$3)","v":"PH-004367"},{"$f":"IF(ISBLANK('FY22-23 Work Plan'!$E$4:$E$4),\"\",TEXT('FY22-23 Work Plan'!$E$4:$E$4,\"000000\"))","v":"000001"},{"$f":"IF(ISBLANK('FY22-23 Work Plan'!$J$4:$J$4),\"\",'FY22-23 Work Plan'!$J$4:$J$4)","v":"Building Skills"},{"$f":"IF(ISBLANK('FY22-23 Work Plan'!$E$5:$E$5),\"\",'FY22-23 Work Plan'!$E$5:$E$5)","v":"2 - San Fernando Valley"},{"$f":"IF(ISBLANK('FY22-23 Work Plan'!$J$5:$J$5),\"\",'FY22-23 Work Plan'!$J$5:$J$5)","v":"3rd District, 4th District"},{"$f":"IF(ISBLANK('FY22-23 Work Plan'!$E$6:$E$6),\"\",'FY22-23 Work Plan'!$E$6:$E$6)","v":"Angeles National Forest*, Artesia, Altadena*"},{"$f":"IF(ISBLANK('FY22-23 Work Plan'!$E$7:$E$7),\"\",'FY22-23 Work Plan'!$E$7:$E$7)","v":"Cadillac-Corning, Angeles National Forest"},{"$f":"IF(ISBLANK('FY22-23 Work Plan'!$E$8:$E$8),\"\",'FY22-23 Work Plan'!$E$8:$E$8)","v":"90032, 90036"},{"$f":"IF(ISBLANK('FY22-23 Work Plan'!$E$9:$E$9),\"\",'FY22-23 Work Plan'!$E$9:$E$9)","v":"123 E Main St., Suite 100 \nAnytown, CA 90000"},{"$f":"IF(ISBLANK('FY22-23 Work Plan'!$J$9:$J$9),\"\",TEXT('FY22-23 Work Plan'!$J$9:$J$9,\"###-###-####\"))","v":"999-999-9999"},{"$f":"IF(ISBLANK('FY22-23 Work Plan'!$J$10:$J$10),\"\",'FY22-23 Work Plan'!$J$10:$J$10)","v":"www.abc1.org"},{"$f":"IF(ISBLANK('FY22-23 Work Plan'!$E$11:$E$11),\"\",'FY22-23 Work Plan'!$E$11:$E$11)","v":"123 E Main St., Suite 100 \nAnytown, CA 90000"},{"$f":"IF(ISBLANK('FY22-23 Work Plan'!$J$11:$J$11),\"\",TEXT('FY22-23 Work Plan'!$J$11:$J$11,\"###-###-####\"))","v":"999-999-9999"},{"$f":"IF(ISBLANK('FY22-23 Work Plan'!$J$12:$J$12),\"\",'FY22-23 Work Plan'!$J$12:$J$12)","v":"www.abc2.org"},{"$f":"IF(ISBLANK('FY22-23 Work Plan'!$E$15:$E$15),\"\",'FY22-23 Work Plan'!$E$15:$E$15)","v":"John/Jane Doe"},{"$f":"IF(ISBLANK('FY22-23 Work Plan'!$H$15:$H$15),\"\",TEXT('FY22-23 Work Plan'!$H$15:$H$15,\"###-###-####\"))","v":"213-555-1212"},{"$f":"IF(ISBLANK('FY22-23 Work Plan'!$J$15:$J$15),\"\",'FY22-23 Work Plan'!$J$15:$J$15)","v":"janedoe@preventionusa.com"},{"$f":"IF(ISBLANK('FY22-23 Work Plan'!$E$16:$E$16),\"\",'FY22-23 Work Plan'!$E$16:$E$16)","v":"John/Jane Doe"},{"$f":"IF(ISBLANK('FY22-23 Work Plan'!$H$16:$H$16),\"\",TEXT('FY22-23 Work Plan'!$H$16:$H$16,\"###-###-####\"))","v":"213-555-1212"},{"$f":"IF(ISBLANK('FY22-23 Work Plan'!$J$16:$J$16),\"\",'FY22-23 Work Plan'!$J$16:$J$16)","v":"janedoe@preventionusa.com"},{"$f":"IF(ISBLANK('FY22-23 Work Plan'!$E$17:$E$17),\"\",'FY22-23 Work Plan'!$E$17:$E$17)","v":"John/Jane Doe"},{"$f":"IF(ISBLANK('FY22-23 Work Plan'!$H$17:$H$17),\"\",TEXT('FY22-23 Work Plan'!$H$17:$H$17,\"###-###-####\"))","v":"213-555-1212"},{"$f":"IF(ISBLANK('FY22-23 Work Plan'!$J$17:$J$17),\"\",'FY22-23 Work Plan'!$J$17:$J$17)","v":"j.doe@preventionusa.com"},{"$f":"IF(ISBLANK('FY22-23 Work Plan'!$E$18:$E$18),\"\",'FY22-23 Work Plan'!$E$18:$E$18)","v":"John/Jane Doe"},{"$f":"IF(ISBLANK('FY22-23 Work Plan'!$H$18:$H$18),\"\",TEXT('FY22-23 Work Plan'!$H$18:$H$18,\"###-###-####\"))","v":"213-555-1213"},{"$f":"IF(ISBLANK('FY22-23 Work Plan'!$J$18:$J$18),\"\",'FY22-23 Work Plan'!$J$18:$J$18)","v":"j.doe@preventionusa.com"},{"$f":"IF(ISBLANK('FY22-23 Work Plan'!$E$19:$E$19),\"\",'FY22-23 Work Plan'!$E$19:$E$19)","v":"John/Jane Doe"},{"$f":"IF(ISBLANK('FY22-23 Work Plan'!$H$19:$H$19),\"\",TEXT('FY22-23 Work Plan'!$H$19:$H$19,\"###-###-####\"))","v":"213-555-1213"},{"$f":"IF(ISBLANK('FY22-23 Work Plan'!$J$19:$J$19),\"\",'FY22-23 Work Plan'!$J$19:$J$19)","v":"j.doe@preventionusa.com"},{"$f":"IF(ISBLANK('FY22-23 Work Plan'!$D$23:$D$23),\"\",'FY22-23 Work Plan'!$D$23:$D$23)","v":""},{"$f":"IF(ISBLANK('FY22-23 Work Plan'!$H$23:$H$23),\"\",'FY22-23 Work Plan'!$H$23:$H$23)","v":""},{"$f":"IF(ISBLANK('FY22-23 Work Plan'!$D$24:$D$24),\"\",'FY22-23 Work Plan'!$D$24:$D$24)","v":""},{"$f":"IF(ISBLANK('FY22-23 Work Plan'!$H$24:$H$24),\"\",'FY22-23 Work Plan'!$H$24:$H$24)","v":""},{"$f":"IF(ISBLANK('FY22-23 Work Plan'!$D$25:$D$25),\"\",'FY22-23 Work Plan'!$D$25:$D$25)","v":""},{"$f":"IF(ISBLANK('FY22-23 Work Plan'!$H$25:$H$25),\"\",'FY22-23 Work Plan'!$H$25:$H$25)","v":""},{"$f":"IF(ISBLANK('FY22-23 Work Plan'!$D$26:$D$26),\"\",'FY22-23 Work Plan'!$D$26:$D$26)","v":""},{"$f":"IF(ISBLANK('FY22-23 Work Plan'!$H$26:$H$26),\"\",'FY22-23 Work Plan'!$H$26:$H$26)","v":""},{"$f":"IF(ISBLANK('FY22-23 Work Plan'!$D$27:$D$27),\"\",'FY22-23 Work Plan'!$D$27:$D$27)","v":""},{"$f":"IF(ISBLANK('FY22-23 Work Plan'!$H$27:$H$27),\"\",'FY22-23 Work Plan'!$H$27:$H$27)","v":""},{"$f":"IF(ISBLANK('FY22-23 Work Plan'!$D$28:$D$28),\"\",'FY22-23 Work Plan'!$D$28:$D$28)","v":""},{"$f":"IF(ISBLANK('FY22-23 Work Plan'!$H$28:$H$28),\"\",'FY22-23 Work Plan'!$H$28:$H$28)","v":""},{"$f":"IF(ISBLANK('FY22-23 Work Plan'!$D$29:$D$29),\"\",'FY22-23 Work Plan'!$D$29:$D$29)","v":""},{"$f":"IF(ISBLANK('FY22-23 Work Plan'!$H$29:$H$29),\"\",'FY22-23 Work Plan'!$H$29:$H$29)","v":""},{"$f":"IF(ISBLANK('FY22-23 Work Plan'!$B$30:$B$30),\"\",'FY22-23 Work Plan'!$B$30:$B$30)","v":""},{"$f":"IF(ISBLANK('FY22-23 Work Plan'!$D$30:$D$30),\"\",'FY22-23 Work Plan'!$D$30:$D$30)","v":""},{"$f":"IF(ISBLANK('FY22-23 Work Plan'!$H$30:$H$30),\"\",'FY22-23 Work Plan'!$H$30:$H$30)","v":""},{"$f":"IF(ISBLANK('FY22-23 Work Plan'!$B$31:$B$31),\"\",'FY22-23 Work Plan'!$B$31:$B$31)","v":""},{"$f":"IF(ISBLANK('FY22-23 Work Plan'!$D$31:$D$31),\"\",'FY22-23 Work Plan'!$D$31:$D$31)","v":""},{"$f":"IF(ISBLANK('FY22-23 Work Plan'!$H$31:$H$31),\"\",'FY22-23 Work Plan'!$H$31:$H$31)","v":""},{"$f":"IF(ISBLANK('FY22-23 Work Plan'!$B$32:$B$32),\"\",'FY22-23 Work Plan'!$B$32:$B$32)","v":""},{"$f":"IF(ISBLANK('FY22-23 Work Plan'!$D$32:$D$32),\"\",'FY22-23 Work Plan'!$D$32:$D$32)","v":""},{"$f":"IF(ISBLANK('FY22-23 Work Plan'!$H$32:$H$32),\"\",'FY22-23 Work Plan'!$H$32:$H$32)","v":""},{"$f":"IF(ISBLANK('FY22-23 Work Plan'!A73),\"\",'FY22-23 Work Plan'!A73)","v":""},{"$f":"IF(ISBLANK('FY22-23 Work Plan'!D73),\"\",'FY22-23 Work Plan'!D73)","v":""},{"$f":"IF(ISBLANK('FY22-23 Work Plan'!E73),\"\",'FY22-23 Work Plan'!E73)","v":""},{"$f":"IF(ISBLANK('FY22-23 Work Plan'!F73),\"\",'FY22-23 Work Plan'!F73)","v":""},{"$f":"IF(ISBLANK('FY22-23 Work Plan'!H73),\"\",'FY22-23 Work Plan'!H73)","v":""},{"$f":"IF(ISBLANK('FY22-23 Work Plan'!I73),\"\",'FY22-23 Work Plan'!I73)","v":""},{"$f":"IF(ISBLANK('FY22-23 Work Plan'!J73),\"\",'FY22-23 Work Plan'!J73)","v":""},{"$f":"IF(ISBLANK('FY22-23 Work Plan'!K73),\"\",'FY22-23 Work Plan'!K73)","v":""},{"$f":"IF(ISBLANK('FY22-23 Work Plan'!L73),\"\",'FY22-23 Work Plan'!L73)","v":""}]
[{"$f":"IF(ISBLANK('FY22-23 Work Plan'!$E$2:$E$2),\"\",'FY22-23 Work Plan'!$E$2:$E$2)","v":"Asian American Drug Abuse Programs, Inc. (AADAP)"},{"$f":"IF(ISBLANK('FY22-23 Work Plan'!$J$2:$J$2),\"\",'FY22-23 Work Plan'!$J$2:$J$2)","v":"Prevention Education Program (PEP)"},{"$f":"IF(ISBLANK('FY22-23 Work Plan'!$J$3:$J$3),\"\",'FY22-23 Work Plan'!$J$3:$J$3)","v":""},{"$f":"IF(ISBLANK('FY22-23 Work Plan'!$E$3:$E$3),\"\",'FY22-23 Work Plan'!$E$3:$E$3)","v":"PH-004367"},{"$f":"IF(ISBLANK('FY22-23 Work Plan'!$E$4:$E$4),\"\",TEXT('FY22-23 Work Plan'!$E$4:$E$4,\"000000\"))","v":"000001"},{"$f":"IF(ISBLANK('FY22-23 Work Plan'!$J$4:$J$4),\"\",'FY22-23 Work Plan'!$J$4:$J$4)","v":"Building Skills"},{"$f":"IF(ISBLANK('FY22-23 Work Plan'!$E$5:$E$5),\"\",'FY22-23 Work Plan'!$E$5:$E$5)","v":"2 - San Fernando Valley"},{"$f":"IF(ISBLANK('FY22-23 Work Plan'!$J$5:$J$5),\"\",'FY22-23 Work Plan'!$J$5:$J$5)","v":"3rd District, 4th District"},{"$f":"IF(ISBLANK('FY22-23 Work Plan'!$E$6:$E$6),\"\",'FY22-23 Work Plan'!$E$6:$E$6)","v":"Angeles National Forest*, Artesia, Altadena*"},{"$f":"IF(ISBLANK('FY22-23 Work Plan'!$E$7:$E$7),\"\",'FY22-23 Work Plan'!$E$7:$E$7)","v":"Cadillac-Corning, Angeles National Forest"},{"$f":"IF(ISBLANK('FY22-23 Work Plan'!$E$8:$E$8),\"\",'FY22-23 Work Plan'!$E$8:$E$8)","v":"90032, 90036"},{"$f":"IF(ISBLANK('FY22-23 Work Plan'!$E$9:$E$9),\"\",'FY22-23 Work Plan'!$E$9:$E$9)","v":"123 E Main St., Suite 100 \nAnytown, CA 90000"},{"$f":"IF(ISBLANK('FY22-23 Work Plan'!$J$9:$J$9),\"\",TEXT('FY22-23 Work Plan'!$J$9:$J$9,\"###-###-####\"))","v":"999-999-9999"},{"$f":"IF(ISBLANK('FY22-23 Work Plan'!$J$10:$J$10),\"\",'FY22-23 Work Plan'!$J$10:$J$10)","v":"www.abc1.org"},{"$f":"IF(ISBLANK('FY22-23 Work Plan'!$E$11:$E$11),\"\",'FY22-23 Work Plan'!$E$11:$E$11)","v":"123 E Main St., Suite 100 \nAnytown, CA 90000"},{"$f":"IF(ISBLANK('FY22-23 Work Plan'!$J$11:$J$11),\"\",TEXT('FY22-23 Work Plan'!$J$11:$J$11,\"###-###-####\"))","v":"999-999-9999"},{"$f":"IF(ISBLANK('FY22-23 Work Plan'!$J$12:$J$12),\"\",'FY22-23 Work Plan'!$J$12:$J$12)","v":"www.abc2.org"},{"$f":"IF(ISBLANK('FY22-23 Work Plan'!$E$15:$E$15),\"\",'FY22-23 Work Plan'!$E$15:$E$15)","v":"John/Jane Doe"},{"$f":"IF(ISBLANK('FY22-23 Work Plan'!$H$15:$H$15),\"\",TEXT('FY22-23 Work Plan'!$H$15:$H$15,\"###-###-####\"))","v":"213-555-1212"},{"$f":"IF(ISBLANK('FY22-23 Work Plan'!$J$15:$J$15),\"\",'FY22-23 Work Plan'!$J$15:$J$15)","v":"janedoe@preventionusa.com"},{"$f":"IF(ISBLANK('FY22-23 Work Plan'!$E$16:$E$16),\"\",'FY22-23 Work Plan'!$E$16:$E$16)","v":"John/Jane Doe"},{"$f":"IF(ISBLANK('FY22-23 Work Plan'!$H$16:$H$16),\"\",TEXT('FY22-23 Work Plan'!$H$16:$H$16,\"###-###-####\"))","v":"213-555-1212"},{"$f":"IF(ISBLANK('FY22-23 Work Plan'!$J$16:$J$16),\"\",'FY22-23 Work Plan'!$J$16:$J$16)","v":"janedoe@preventionusa.com"},{"$f":"IF(ISBLANK('FY22-23 Work Plan'!$E$17:$E$17),\"\",'FY22-23 Work Plan'!$E$17:$E$17)","v":"John/Jane Doe"},{"$f":"IF(ISBLANK('FY22-23 Work Plan'!$H$17:$H$17),\"\",TEXT('FY22-23 Work Plan'!$H$17:$H$17,\"###-###-####\"))","v":"213-555-1212"},{"$f":"IF(ISBLANK('FY22-23 Work Plan'!$J$17:$J$17),\"\",'FY22-23 Work Plan'!$J$17:$J$17)","v":"j.doe@preventionusa.com"},{"$f":"IF(ISBLANK('FY22-23 Work Plan'!$E$18:$E$18),\"\",'FY22-23 Work Plan'!$E$18:$E$18)","v":"John/Jane Doe"},{"$f":"IF(ISBLANK('FY22-23 Work Plan'!$H$18:$H$18),\"\",TEXT('FY22-23 Work Plan'!$H$18:$H$18,\"###-###-####\"))","v":"213-555-1213"},{"$f":"IF(ISBLANK('FY22-23 Work Plan'!$J$18:$J$18),\"\",'FY22-23 Work Plan'!$J$18:$J$18)","v":"j.doe@preventionusa.com"},{"$f":"IF(ISBLANK('FY22-23 Work Plan'!$E$19:$E$19),\"\",'FY22-23 Work Plan'!$E$19:$E$19)","v":"John/Jane Doe"},{"$f":"IF(ISBLANK('FY22-23 Work Plan'!$H$19:$H$19),\"\",TEXT('FY22-23 Work Plan'!$H$19:$H$19,\"###-###-####\"))","v":"213-555-1213"},{"$f":"IF(ISBLANK('FY22-23 Work Plan'!$J$19:$J$19),\"\",'FY22-23 Work Plan'!$J$19:$J$19)","v":"j.doe@preventionusa.com"},{"$f":"IF(ISBLANK('FY22-23 Work Plan'!$D$23:$D$23),\"\",'FY22-23 Work Plan'!$D$23:$D$23)","v":""},{"$f":"IF(ISBLANK('FY22-23 Work Plan'!$H$23:$H$23),\"\",'FY22-23 Work Plan'!$H$23:$H$23)","v":""},{"$f":"IF(ISBLANK('FY22-23 Work Plan'!$D$24:$D$24),\"\",'FY22-23 Work Plan'!$D$24:$D$24)","v":""},{"$f":"IF(ISBLANK('FY22-23 Work Plan'!$H$24:$H$24),\"\",'FY22-23 Work Plan'!$H$24:$H$24)","v":""},{"$f":"IF(ISBLANK('FY22-23 Work Plan'!$D$25:$D$25),\"\",'FY22-23 Work Plan'!$D$25:$D$25)","v":""},{"$f":"IF(ISBLANK('FY22-23 Work Plan'!$H$25:$H$25),\"\",'FY22-23 Work Plan'!$H$25:$H$25)","v":""},{"$f":"IF(ISBLANK('FY22-23 Work Plan'!$D$26:$D$26),\"\",'FY22-23 Work Plan'!$D$26:$D$26)","v":""},{"$f":"IF(ISBLANK('FY22-23 Work Plan'!$H$26:$H$26),\"\",'FY22-23 Work Plan'!$H$26:$H$26)","v":""},{"$f":"IF(ISBLANK('FY22-23 Work Plan'!$D$27:$D$27),\"\",'FY22-23 Work Plan'!$D$27:$D$27)","v":""},{"$f":"IF(ISBLANK('FY22-23 Work Plan'!$H$27:$H$27),\"\",'FY22-23 Work Plan'!$H$27:$H$27)","v":""},{"$f":"IF(ISBLANK('FY22-23 Work Plan'!$D$28:$D$28),\"\",'FY22-23 Work Plan'!$D$28:$D$28)","v":""},{"$f":"IF(ISBLANK('FY22-23 Work Plan'!$H$28:$H$28),\"\",'FY22-23 Work Plan'!$H$28:$H$28)","v":""},{"$f":"IF(ISBLANK('FY22-23 Work Plan'!$D$29:$D$29),\"\",'FY22-23 Work Plan'!$D$29:$D$29)","v":""},{"$f":"IF(ISBLANK('FY22-23 Work Plan'!$H$29:$H$29),\"\",'FY22-23 Work Plan'!$H$29:$H$29)","v":""},{"$f":"IF(ISBLANK('FY22-23 Work Plan'!$B$30:$B$30),\"\",'FY22-23 Work Plan'!$B$30:$B$30)","v":""},{"$f":"IF(ISBLANK('FY22-23 Work Plan'!$D$30:$D$30),\"\",'FY22-23 Work Plan'!$D$30:$D$30)","v":""},{"$f":"IF(ISBLANK('FY22-23 Work Plan'!$H$30:$H$30),\"\",'FY22-23 Work Plan'!$H$30:$H$30)","v":""},{"$f":"IF(ISBLANK('FY22-23 Work Plan'!$B$31:$B$31),\"\",'FY22-23 Work Plan'!$B$31:$B$31)","v":""},{"$f":"IF(ISBLANK('FY22-23 Work Plan'!$D$31:$D$31),\"\",'FY22-23 Work Plan'!$D$31:$D$31)","v":""},{"$f":"IF(ISBLANK('FY22-23 Work Plan'!$H$31:$H$31),\"\",'FY22-23 Work Plan'!$H$31:$H$31)","v":""},{"$f":"IF(ISBLANK('FY22-23 Work Plan'!$B$32:$B$32),\"\",'FY22-23 Work Plan'!$B$32:$B$32)","v":""},{"$f":"IF(ISBLANK('FY22-23 Work Plan'!$D$32:$D$32),\"\",'FY22-23 Work Plan'!$D$32:$D$32)","v":""},{"$f":"IF(ISBLANK('FY22-23 Work Plan'!$H$32:$H$32),\"\",'FY22-23 Work Plan'!$H$32:$H$32)","v":""},{"$f":"IF(ISBLANK('FY22-23 Work Plan'!A74),\"\",'FY22-23 Work Plan'!A74)","v":""},{"$f":"IF(ISBLANK('FY22-23 Work Plan'!D74),\"\",'FY22-23 Work Plan'!D74)","v":""},{"$f":"IF(ISBLANK('FY22-23 Work Plan'!E74),\"\",'FY22-23 Work Plan'!E74)","v":""},{"$f":"IF(ISBLANK('FY22-23 Work Plan'!F74),\"\",'FY22-23 Work Plan'!F74)","v":""},{"$f":"IF(ISBLANK('FY22-23 Work Plan'!H74),\"\",'FY22-23 Work Plan'!H74)","v":""},{"$f":"IF(ISBLANK('FY22-23 Work Plan'!I74),\"\",'FY22-23 Work Plan'!I74)","v":""},{"$f":"IF(ISBLANK('FY22-23 Work Plan'!J74),\"\",'FY22-23 Work Plan'!J74)","v":""},{"$f":"IF(ISBLANK('FY22-23 Work Plan'!K74),\"\",'FY22-23 Work Plan'!K74)","v":""},{"$f":"IF(ISBLANK('FY22-23 Work Plan'!L74),\"\",'FY22-23 Work Plan'!L74)","v":""}]
[{"$f":"IF(ISBLANK('FY22-23 Work Plan'!$E$2:$E$2),\"\",'FY22-23 Work Plan'!$E$2:$E$2)","v":"Asian American Drug Abuse Programs, Inc. (AADAP)"},{"$f":"IF(ISBLANK('FY22-23 Work Plan'!$J$2:$J$2),\"\",'FY22-23 Work Plan'!$J$2:$J$2)","v":"Prevention Education Program (PEP)"},{"$f":"IF(ISBLANK('FY22-23 Work Plan'!$J$3:$J$3),\"\",'FY22-23 Work Plan'!$J$3:$J$3)","v":""},{"$f":"IF(ISBLANK('FY22-23 Work Plan'!$E$3:$E$3),\"\",'FY22-23 Work Plan'!$E$3:$E$3)","v":"PH-004367"},{"$f":"IF(ISBLANK('FY22-23 Work Plan'!$E$4:$E$4),\"\",TEXT('FY22-23 Work Plan'!$E$4:$E$4,\"000000\"))","v":"000001"},{"$f":"IF(ISBLANK('FY22-23 Work Plan'!$J$4:$J$4),\"\",'FY22-23 Work Plan'!$J$4:$J$4)","v":"Building Skills"},{"$f":"IF(ISBLANK('FY22-23 Work Plan'!$E$5:$E$5),\"\",'FY22-23 Work Plan'!$E$5:$E$5)","v":"2 - San Fernando Valley"},{"$f":"IF(ISBLANK('FY22-23 Work Plan'!$J$5:$J$5),\"\",'FY22-23 Work Plan'!$J$5:$J$5)","v":"3rd District, 4th District"},{"$f":"IF(ISBLANK('FY22-23 Work Plan'!$E$6:$E$6),\"\",'FY22-23 Work Plan'!$E$6:$E$6)","v":"Angeles National Forest*, Artesia, Altadena*"},{"$f":"IF(ISBLANK('FY22-23 Work Plan'!$E$7:$E$7),\"\",'FY22-23 Work Plan'!$E$7:$E$7)","v":"Cadillac-Corning, Angeles National Forest"},{"$f":"IF(ISBLANK('FY22-23 Work Plan'!$E$8:$E$8),\"\",'FY22-23 Work Plan'!$E$8:$E$8)","v":"90032, 90036"},{"$f":"IF(ISBLANK('FY22-23 Work Plan'!$E$9:$E$9),\"\",'FY22-23 Work Plan'!$E$9:$E$9)","v":"123 E Main St., Suite 100 \nAnytown, CA 90000"},{"$f":"IF(ISBLANK('FY22-23 Work Plan'!$J$9:$J$9),\"\",TEXT('FY22-23 Work Plan'!$J$9:$J$9,\"###-###-####\"))","v":"999-999-9999"},{"$f":"IF(ISBLANK('FY22-23 Work Plan'!$J$10:$J$10),\"\",'FY22-23 Work Plan'!$J$10:$J$10)","v":"www.abc1.org"},{"$f":"IF(ISBLANK('FY22-23 Work Plan'!$E$11:$E$11),\"\",'FY22-23 Work Plan'!$E$11:$E$11)","v":"123 E Main St., Suite 100 \nAnytown, CA 90000"},{"$f":"IF(ISBLANK('FY22-23 Work Plan'!$J$11:$J$11),\"\",TEXT('FY22-23 Work Plan'!$J$11:$J$11,\"###-###-####\"))","v":"999-999-9999"},{"$f":"IF(ISBLANK('FY22-23 Work Plan'!$J$12:$J$12),\"\",'FY22-23 Work Plan'!$J$12:$J$12)","v":"www.abc2.org"},{"$f":"IF(ISBLANK('FY22-23 Work Plan'!$E$15:$E$15),\"\",'FY22-23 Work Plan'!$E$15:$E$15)","v":"John/Jane Doe"},{"$f":"IF(ISBLANK('FY22-23 Work Plan'!$H$15:$H$15),\"\",TEXT('FY22-23 Work Plan'!$H$15:$H$15,\"###-###-####\"))","v":"213-555-1212"},{"$f":"IF(ISBLANK('FY22-23 Work Plan'!$J$15:$J$15),\"\",'FY22-23 Work Plan'!$J$15:$J$15)","v":"janedoe@preventionusa.com"},{"$f":"IF(ISBLANK('FY22-23 Work Plan'!$E$16:$E$16),\"\",'FY22-23 Work Plan'!$E$16:$E$16)","v":"John/Jane Doe"},{"$f":"IF(ISBLANK('FY22-23 Work Plan'!$H$16:$H$16),\"\",TEXT('FY22-23 Work Plan'!$H$16:$H$16,\"###-###-####\"))","v":"213-555-1212"},{"$f":"IF(ISBLANK('FY22-23 Work Plan'!$J$16:$J$16),\"\",'FY22-23 Work Plan'!$J$16:$J$16)","v":"janedoe@preventionusa.com"},{"$f":"IF(ISBLANK('FY22-23 Work Plan'!$E$17:$E$17),\"\",'FY22-23 Work Plan'!$E$17:$E$17)","v":"John/Jane Doe"},{"$f":"IF(ISBLANK('FY22-23 Work Plan'!$H$17:$H$17),\"\",TEXT('FY22-23 Work Plan'!$H$17:$H$17,\"###-###-####\"))","v":"213-555-1212"},{"$f":"IF(ISBLANK('FY22-23 Work Plan'!$J$17:$J$17),\"\",'FY22-23 Work Plan'!$J$17:$J$17)","v":"j.doe@preventionusa.com"},{"$f":"IF(ISBLANK('FY22-23 Work Plan'!$E$18:$E$18),\"\",'FY22-23 Work Plan'!$E$18:$E$18)","v":"John/Jane Doe"},{"$f":"IF(ISBLANK('FY22-23 Work Plan'!$H$18:$H$18),\"\",TEXT('FY22-23 Work Plan'!$H$18:$H$18,\"###-###-####\"))","v":"213-555-1213"},{"$f":"IF(ISBLANK('FY22-23 Work Plan'!$J$18:$J$18),\"\",'FY22-23 Work Plan'!$J$18:$J$18)","v":"j.doe@preventionusa.com"},{"$f":"IF(ISBLANK('FY22-23 Work Plan'!$E$19:$E$19),\"\",'FY22-23 Work Plan'!$E$19:$E$19)","v":"John/Jane Doe"},{"$f":"IF(ISBLANK('FY22-23 Work Plan'!$H$19:$H$19),\"\",TEXT('FY22-23 Work Plan'!$H$19:$H$19,\"###-###-####\"))","v":"213-555-1213"},{"$f":"IF(ISBLANK('FY22-23 Work Plan'!$J$19:$J$19),\"\",'FY22-23 Work Plan'!$J$19:$J$19)","v":"j.doe@preventionusa.com"},{"$f":"IF(ISBLANK('FY22-23 Work Plan'!$D$23:$D$23),\"\",'FY22-23 Work Plan'!$D$23:$D$23)","v":""},{"$f":"IF(ISBLANK('FY22-23 Work Plan'!$H$23:$H$23),\"\",'FY22-23 Work Plan'!$H$23:$H$23)","v":""},{"$f":"IF(ISBLANK('FY22-23 Work Plan'!$D$24:$D$24),\"\",'FY22-23 Work Plan'!$D$24:$D$24)","v":""},{"$f":"IF(ISBLANK('FY22-23 Work Plan'!$H$24:$H$24),\"\",'FY22-23 Work Plan'!$H$24:$H$24)","v":""},{"$f":"IF(ISBLANK('FY22-23 Work Plan'!$D$25:$D$25),\"\",'FY22-23 Work Plan'!$D$25:$D$25)","v":""},{"$f":"IF(ISBLANK('FY22-23 Work Plan'!$H$25:$H$25),\"\",'FY22-23 Work Plan'!$H$25:$H$25)","v":""},{"$f":"IF(ISBLANK('FY22-23 Work Plan'!$D$26:$D$26),\"\",'FY22-23 Work Plan'!$D$26:$D$26)","v":""},{"$f":"IF(ISBLANK('FY22-23 Work Plan'!$H$26:$H$26),\"\",'FY22-23 Work Plan'!$H$26:$H$26)","v":""},{"$f":"IF(ISBLANK('FY22-23 Work Plan'!$D$27:$D$27),\"\",'FY22-23 Work Plan'!$D$27:$D$27)","v":""},{"$f":"IF(ISBLANK('FY22-23 Work Plan'!$H$27:$H$27),\"\",'FY22-23 Work Plan'!$H$27:$H$27)","v":""},{"$f":"IF(ISBLANK('FY22-23 Work Plan'!$D$28:$D$28),\"\",'FY22-23 Work Plan'!$D$28:$D$28)","v":""},{"$f":"IF(ISBLANK('FY22-23 Work Plan'!$H$28:$H$28),\"\",'FY22-23 Work Plan'!$H$28:$H$28)","v":""},{"$f":"IF(ISBLANK('FY22-23 Work Plan'!$D$29:$D$29),\"\",'FY22-23 Work Plan'!$D$29:$D$29)","v":""},{"$f":"IF(ISBLANK('FY22-23 Work Plan'!$H$29:$H$29),\"\",'FY22-23 Work Plan'!$H$29:$H$29)","v":""},{"$f":"IF(ISBLANK('FY22-23 Work Plan'!$B$30:$B$30),\"\",'FY22-23 Work Plan'!$B$30:$B$30)","v":""},{"$f":"IF(ISBLANK('FY22-23 Work Plan'!$D$30:$D$30),\"\",'FY22-23 Work Plan'!$D$30:$D$30)","v":""},{"$f":"IF(ISBLANK('FY22-23 Work Plan'!$H$30:$H$30),\"\",'FY22-23 Work Plan'!$H$30:$H$30)","v":""},{"$f":"IF(ISBLANK('FY22-23 Work Plan'!$B$31:$B$31),\"\",'FY22-23 Work Plan'!$B$31:$B$31)","v":""},{"$f":"IF(ISBLANK('FY22-23 Work Plan'!$D$31:$D$31),\"\",'FY22-23 Work Plan'!$D$31:$D$31)","v":""},{"$f":"IF(ISBLANK('FY22-23 Work Plan'!$H$31:$H$31),\"\",'FY22-23 Work Plan'!$H$31:$H$31)","v":""},{"$f":"IF(ISBLANK('FY22-23 Work Plan'!$B$32:$B$32),\"\",'FY22-23 Work Plan'!$B$32:$B$32)","v":""},{"$f":"IF(ISBLANK('FY22-23 Work Plan'!$D$32:$D$32),\"\",'FY22-23 Work Plan'!$D$32:$D$32)","v":""},{"$f":"IF(ISBLANK('FY22-23 Work Plan'!$H$32:$H$32),\"\",'FY22-23 Work Plan'!$H$32:$H$32)","v":""},{"$f":"IF(ISBLANK('FY22-23 Work Plan'!A75),\"\",'FY22-23 Work Plan'!A75)","v":""},{"$f":"IF(ISBLANK('FY22-23 Work Plan'!D75),\"\",'FY22-23 Work Plan'!D75)","v":""},{"$f":"IF(ISBLANK('FY22-23 Work Plan'!E75),\"\",'FY22-23 Work Plan'!E75)","v":""},{"$f":"IF(ISBLANK('FY22-23 Work Plan'!F75),\"\",'FY22-23 Work Plan'!F75)","v":""},{"$f":"IF(ISBLANK('FY22-23 Work Plan'!H75),\"\",'FY22-23 Work Plan'!H75)","v":""},{"$f":"IF(ISBLANK('FY22-23 Work Plan'!I75),\"\",'FY22-23 Work Plan'!I75)","v":""},{"$f":"IF(ISBLANK('FY22-23 Work Plan'!J75),\"\",'FY22-23 Work Plan'!J75)","v":""},{"$f":"IF(ISBLANK('FY22-23 Work Plan'!K75),\"\",'FY22-23 Work Plan'!K75)","v":""},{"$f":"IF(ISBLANK('FY22-23 Work Plan'!L75),\"\",'FY22-23 Work Plan'!L75)","v":""}]
[{"$f":"IF(ISBLANK('FY22-23 Work Plan'!$E$2:$E$2),\"\",'FY22-23 Work Plan'!$E$2:$E$2)","v":"Asian American Drug Abuse Programs, Inc. (AADAP)"},{"$f":"IF(ISBLANK('FY22-23 Work Plan'!$J$2:$J$2),\"\",'FY22-23 Work Plan'!$J$2:$J$2)","v":"Prevention Education Program (PEP)"},{"$f":"IF(ISBLANK('FY22-23 Work Plan'!$J$3:$J$3),\"\",'FY22-23 Work Plan'!$J$3:$J$3)","v":""},{"$f":"IF(ISBLANK('FY22-23 Work Plan'!$E$3:$E$3),\"\",'FY22-23 Work Plan'!$E$3:$E$3)","v":"PH-004367"},{"$f":"IF(ISBLANK('FY22-23 Work Plan'!$E$4:$E$4),\"\",TEXT('FY22-23 Work Plan'!$E$4:$E$4,\"000000\"))","v":"000001"},{"$f":"IF(ISBLANK('FY22-23 Work Plan'!$J$4:$J$4),\"\",'FY22-23 Work Plan'!$J$4:$J$4)","v":"Building Skills"},{"$f":"IF(ISBLANK('FY22-23 Work Plan'!$E$5:$E$5),\"\",'FY22-23 Work Plan'!$E$5:$E$5)","v":"2 - San Fernando Valley"},{"$f":"IF(ISBLANK('FY22-23 Work Plan'!$J$5:$J$5),\"\",'FY22-23 Work Plan'!$J$5:$J$5)","v":"3rd District, 4th District"},{"$f":"IF(ISBLANK('FY22-23 Work Plan'!$E$6:$E$6),\"\",'FY22-23 Work Plan'!$E$6:$E$6)","v":"Angeles National Forest*, Artesia, Altadena*"},{"$f":"IF(ISBLANK('FY22-23 Work Plan'!$E$7:$E$7),\"\",'FY22-23 Work Plan'!$E$7:$E$7)","v":"Cadillac-Corning, Angeles National Forest"},{"$f":"IF(ISBLANK('FY22-23 Work Plan'!$E$8:$E$8),\"\",'FY22-23 Work Plan'!$E$8:$E$8)","v":"90032, 90036"},{"$f":"IF(ISBLANK('FY22-23 Work Plan'!$E$9:$E$9),\"\",'FY22-23 Work Plan'!$E$9:$E$9)","v":"123 E Main St., Suite 100 \nAnytown, CA 90000"},{"$f":"IF(ISBLANK('FY22-23 Work Plan'!$J$9:$J$9),\"\",TEXT('FY22-23 Work Plan'!$J$9:$J$9,\"###-###-####\"))","v":"999-999-9999"},{"$f":"IF(ISBLANK('FY22-23 Work Plan'!$J$10:$J$10),\"\",'FY22-23 Work Plan'!$J$10:$J$10)","v":"www.abc1.org"},{"$f":"IF(ISBLANK('FY22-23 Work Plan'!$E$11:$E$11),\"\",'FY22-23 Work Plan'!$E$11:$E$11)","v":"123 E Main St., Suite 100 \nAnytown, CA 90000"},{"$f":"IF(ISBLANK('FY22-23 Work Plan'!$J$11:$J$11),\"\",TEXT('FY22-23 Work Plan'!$J$11:$J$11,\"###-###-####\"))","v":"999-999-9999"},{"$f":"IF(ISBLANK('FY22-23 Work Plan'!$J$12:$J$12),\"\",'FY22-23 Work Plan'!$J$12:$J$12)","v":"www.abc2.org"},{"$f":"IF(ISBLANK('FY22-23 Work Plan'!$E$15:$E$15),\"\",'FY22-23 Work Plan'!$E$15:$E$15)","v":"John/Jane Doe"},{"$f":"IF(ISBLANK('FY22-23 Work Plan'!$H$15:$H$15),\"\",TEXT('FY22-23 Work Plan'!$H$15:$H$15,\"###-###-####\"))","v":"213-555-1212"},{"$f":"IF(ISBLANK('FY22-23 Work Plan'!$J$15:$J$15),\"\",'FY22-23 Work Plan'!$J$15:$J$15)","v":"janedoe@preventionusa.com"},{"$f":"IF(ISBLANK('FY22-23 Work Plan'!$E$16:$E$16),\"\",'FY22-23 Work Plan'!$E$16:$E$16)","v":"John/Jane Doe"},{"$f":"IF(ISBLANK('FY22-23 Work Plan'!$H$16:$H$16),\"\",TEXT('FY22-23 Work Plan'!$H$16:$H$16,\"###-###-####\"))","v":"213-555-1212"},{"$f":"IF(ISBLANK('FY22-23 Work Plan'!$J$16:$J$16),\"\",'FY22-23 Work Plan'!$J$16:$J$16)","v":"janedoe@preventionusa.com"},{"$f":"IF(ISBLANK('FY22-23 Work Plan'!$E$17:$E$17),\"\",'FY22-23 Work Plan'!$E$17:$E$17)","v":"John/Jane Doe"},{"$f":"IF(ISBLANK('FY22-23 Work Plan'!$H$17:$H$17),\"\",TEXT('FY22-23 Work Plan'!$H$17:$H$17,\"###-###-####\"))","v":"213-555-1212"},{"$f":"IF(ISBLANK('FY22-23 Work Plan'!$J$17:$J$17),\"\",'FY22-23 Work Plan'!$J$17:$J$17)","v":"j.doe@preventionusa.com"},{"$f":"IF(ISBLANK('FY22-23 Work Plan'!$E$18:$E$18),\"\",'FY22-23 Work Plan'!$E$18:$E$18)","v":"John/Jane Doe"},{"$f":"IF(ISBLANK('FY22-23 Work Plan'!$H$18:$H$18),\"\",TEXT('FY22-23 Work Plan'!$H$18:$H$18,\"###-###-####\"))","v":"213-555-1213"},{"$f":"IF(ISBLANK('FY22-23 Work Plan'!$J$18:$J$18),\"\",'FY22-23 Work Plan'!$J$18:$J$18)","v":"j.doe@preventionusa.com"},{"$f":"IF(ISBLANK('FY22-23 Work Plan'!$E$19:$E$19),\"\",'FY22-23 Work Plan'!$E$19:$E$19)","v":"John/Jane Doe"},{"$f":"IF(ISBLANK('FY22-23 Work Plan'!$H$19:$H$19),\"\",TEXT('FY22-23 Work Plan'!$H$19:$H$19,\"###-###-####\"))","v":"213-555-1213"},{"$f":"IF(ISBLANK('FY22-23 Work Plan'!$J$19:$J$19),\"\",'FY22-23 Work Plan'!$J$19:$J$19)","v":"j.doe@preventionusa.com"},{"$f":"IF(ISBLANK('FY22-23 Work Plan'!$D$23:$D$23),\"\",'FY22-23 Work Plan'!$D$23:$D$23)","v":""},{"$f":"IF(ISBLANK('FY22-23 Work Plan'!$H$23:$H$23),\"\",'FY22-23 Work Plan'!$H$23:$H$23)","v":""},{"$f":"IF(ISBLANK('FY22-23 Work Plan'!$D$24:$D$24),\"\",'FY22-23 Work Plan'!$D$24:$D$24)","v":""},{"$f":"IF(ISBLANK('FY22-23 Work Plan'!$H$24:$H$24),\"\",'FY22-23 Work Plan'!$H$24:$H$24)","v":""},{"$f":"IF(ISBLANK('FY22-23 Work Plan'!$D$25:$D$25),\"\",'FY22-23 Work Plan'!$D$25:$D$25)","v":""},{"$f":"IF(ISBLANK('FY22-23 Work Plan'!$H$25:$H$25),\"\",'FY22-23 Work Plan'!$H$25:$H$25)","v":""},{"$f":"IF(ISBLANK('FY22-23 Work Plan'!$D$26:$D$26),\"\",'FY22-23 Work Plan'!$D$26:$D$26)","v":""},{"$f":"IF(ISBLANK('FY22-23 Work Plan'!$H$26:$H$26),\"\",'FY22-23 Work Plan'!$H$26:$H$26)","v":""},{"$f":"IF(ISBLANK('FY22-23 Work Plan'!$D$27:$D$27),\"\",'FY22-23 Work Plan'!$D$27:$D$27)","v":""},{"$f":"IF(ISBLANK('FY22-23 Work Plan'!$H$27:$H$27),\"\",'FY22-23 Work Plan'!$H$27:$H$27)","v":""},{"$f":"IF(ISBLANK('FY22-23 Work Plan'!$D$28:$D$28),\"\",'FY22-23 Work Plan'!$D$28:$D$28)","v":""},{"$f":"IF(ISBLANK('FY22-23 Work Plan'!$H$28:$H$28),\"\",'FY22-23 Work Plan'!$H$28:$H$28)","v":""},{"$f":"IF(ISBLANK('FY22-23 Work Plan'!$D$29:$D$29),\"\",'FY22-23 Work Plan'!$D$29:$D$29)","v":""},{"$f":"IF(ISBLANK('FY22-23 Work Plan'!$H$29:$H$29),\"\",'FY22-23 Work Plan'!$H$29:$H$29)","v":""},{"$f":"IF(ISBLANK('FY22-23 Work Plan'!$B$30:$B$30),\"\",'FY22-23 Work Plan'!$B$30:$B$30)","v":""},{"$f":"IF(ISBLANK('FY22-23 Work Plan'!$D$30:$D$30),\"\",'FY22-23 Work Plan'!$D$30:$D$30)","v":""},{"$f":"IF(ISBLANK('FY22-23 Work Plan'!$H$30:$H$30),\"\",'FY22-23 Work Plan'!$H$30:$H$30)","v":""},{"$f":"IF(ISBLANK('FY22-23 Work Plan'!$B$31:$B$31),\"\",'FY22-23 Work Plan'!$B$31:$B$31)","v":""},{"$f":"IF(ISBLANK('FY22-23 Work Plan'!$D$31:$D$31),\"\",'FY22-23 Work Plan'!$D$31:$D$31)","v":""},{"$f":"IF(ISBLANK('FY22-23 Work Plan'!$H$31:$H$31),\"\",'FY22-23 Work Plan'!$H$31:$H$31)","v":""},{"$f":"IF(ISBLANK('FY22-23 Work Plan'!$B$32:$B$32),\"\",'FY22-23 Work Plan'!$B$32:$B$32)","v":""},{"$f":"IF(ISBLANK('FY22-23 Work Plan'!$D$32:$D$32),\"\",'FY22-23 Work Plan'!$D$32:$D$32)","v":""},{"$f":"IF(ISBLANK('FY22-23 Work Plan'!$H$32:$H$32),\"\",'FY22-23 Work Plan'!$H$32:$H$32)","v":""},{"$f":"IF(ISBLANK('FY22-23 Work Plan'!A76),\"\",'FY22-23 Work Plan'!A76)","v":""},{"$f":"IF(ISBLANK('FY22-23 Work Plan'!D76),\"\",'FY22-23 Work Plan'!D76)","v":""},{"$f":"IF(ISBLANK('FY22-23 Work Plan'!E76),\"\",'FY22-23 Work Plan'!E76)","v":""},{"$f":"IF(ISBLANK('FY22-23 Work Plan'!F76),\"\",'FY22-23 Work Plan'!F76)","v":""},{"$f":"IF(ISBLANK('FY22-23 Work Plan'!H76),\"\",'FY22-23 Work Plan'!H76)","v":""},{"$f":"IF(ISBLANK('FY22-23 Work Plan'!I76),\"\",'FY22-23 Work Plan'!I76)","v":""},{"$f":"IF(ISBLANK('FY22-23 Work Plan'!J76),\"\",'FY22-23 Work Plan'!J76)","v":""},{"$f":"IF(ISBLANK('FY22-23 Work Plan'!K76),\"\",'FY22-23 Work Plan'!K76)","v":""},{"$f":"IF(ISBLANK('FY22-23 Work Plan'!L76),\"\",'FY22-23 Work Plan'!L76)","v":""}]
[{"$f":"IF(ISBLANK('FY22-23 Work Plan'!$E$2:$E$2),\"\",'FY22-23 Work Plan'!$E$2:$E$2)","v":"Asian American Drug Abuse Programs, Inc. (AADAP)"},{"$f":"IF(ISBLANK('FY22-23 Work Plan'!$J$2:$J$2),\"\",'FY22-23 Work Plan'!$J$2:$J$2)","v":"Prevention Education Program (PEP)"},{"$f":"IF(ISBLANK('FY22-23 Work Plan'!$J$3:$J$3),\"\",'FY22-23 Work Plan'!$J$3:$J$3)","v":""},{"$f":"IF(ISBLANK('FY22-23 Work Plan'!$E$3:$E$3),\"\",'FY22-23 Work Plan'!$E$3:$E$3)","v":"PH-004367"},{"$f":"IF(ISBLANK('FY22-23 Work Plan'!$E$4:$E$4),\"\",TEXT('FY22-23 Work Plan'!$E$4:$E$4,\"000000\"))","v":"000001"},{"$f":"IF(ISBLANK('FY22-23 Work Plan'!$J$4:$J$4),\"\",'FY22-23 Work Plan'!$J$4:$J$4)","v":"Building Skills"},{"$f":"IF(ISBLANK('FY22-23 Work Plan'!$E$5:$E$5),\"\",'FY22-23 Work Plan'!$E$5:$E$5)","v":"2 - San Fernando Valley"},{"$f":"IF(ISBLANK('FY22-23 Work Plan'!$J$5:$J$5),\"\",'FY22-23 Work Plan'!$J$5:$J$5)","v":"3rd District, 4th District"},{"$f":"IF(ISBLANK('FY22-23 Work Plan'!$E$6:$E$6),\"\",'FY22-23 Work Plan'!$E$6:$E$6)","v":"Angeles National Forest*, Artesia, Altadena*"},{"$f":"IF(ISBLANK('FY22-23 Work Plan'!$E$7:$E$7),\"\",'FY22-23 Work Plan'!$E$7:$E$7)","v":"Cadillac-Corning, Angeles National Forest"},{"$f":"IF(ISBLANK('FY22-23 Work Plan'!$E$8:$E$8),\"\",'FY22-23 Work Plan'!$E$8:$E$8)","v":"90032, 90036"},{"$f":"IF(ISBLANK('FY22-23 Work Plan'!$E$9:$E$9),\"\",'FY22-23 Work Plan'!$E$9:$E$9)","v":"123 E Main St., Suite 100 \nAnytown, CA 90000"},{"$f":"IF(ISBLANK('FY22-23 Work Plan'!$J$9:$J$9),\"\",TEXT('FY22-23 Work Plan'!$J$9:$J$9,\"###-###-####\"))","v":"999-999-9999"},{"$f":"IF(ISBLANK('FY22-23 Work Plan'!$J$10:$J$10),\"\",'FY22-23 Work Plan'!$J$10:$J$10)","v":"www.abc1.org"},{"$f":"IF(ISBLANK('FY22-23 Work Plan'!$E$11:$E$11),\"\",'FY22-23 Work Plan'!$E$11:$E$11)","v":"123 E Main St., Suite 100 \nAnytown, CA 90000"},{"$f":"IF(ISBLANK('FY22-23 Work Plan'!$J$11:$J$11),\"\",TEXT('FY22-23 Work Plan'!$J$11:$J$11,\"###-###-####\"))","v":"999-999-9999"},{"$f":"IF(ISBLANK('FY22-23 Work Plan'!$J$12:$J$12),\"\",'FY22-23 Work Plan'!$J$12:$J$12)","v":"www.abc2.org"},{"$f":"IF(ISBLANK('FY22-23 Work Plan'!$E$15:$E$15),\"\",'FY22-23 Work Plan'!$E$15:$E$15)","v":"John/Jane Doe"},{"$f":"IF(ISBLANK('FY22-23 Work Plan'!$H$15:$H$15),\"\",TEXT('FY22-23 Work Plan'!$H$15:$H$15,\"###-###-####\"))","v":"213-555-1212"},{"$f":"IF(ISBLANK('FY22-23 Work Plan'!$J$15:$J$15),\"\",'FY22-23 Work Plan'!$J$15:$J$15)","v":"janedoe@preventionusa.com"},{"$f":"IF(ISBLANK('FY22-23 Work Plan'!$E$16:$E$16),\"\",'FY22-23 Work Plan'!$E$16:$E$16)","v":"John/Jane Doe"},{"$f":"IF(ISBLANK('FY22-23 Work Plan'!$H$16:$H$16),\"\",TEXT('FY22-23 Work Plan'!$H$16:$H$16,\"###-###-####\"))","v":"213-555-1212"},{"$f":"IF(ISBLANK('FY22-23 Work Plan'!$J$16:$J$16),\"\",'FY22-23 Work Plan'!$J$16:$J$16)","v":"janedoe@preventionusa.com"},{"$f":"IF(ISBLANK('FY22-23 Work Plan'!$E$17:$E$17),\"\",'FY22-23 Work Plan'!$E$17:$E$17)","v":"John/Jane Doe"},{"$f":"IF(ISBLANK('FY22-23 Work Plan'!$H$17:$H$17),\"\",TEXT('FY22-23 Work Plan'!$H$17:$H$17,\"###-###-####\"))","v":"213-555-1212"},{"$f":"IF(ISBLANK('FY22-23 Work Plan'!$J$17:$J$17),\"\",'FY22-23 Work Plan'!$J$17:$J$17)","v":"j.doe@preventionusa.com"},{"$f":"IF(ISBLANK('FY22-23 Work Plan'!$E$18:$E$18),\"\",'FY22-23 Work Plan'!$E$18:$E$18)","v":"John/Jane Doe"},{"$f":"IF(ISBLANK('FY22-23 Work Plan'!$H$18:$H$18),\"\",TEXT('FY22-23 Work Plan'!$H$18:$H$18,\"###-###-####\"))","v":"213-555-1213"},{"$f":"IF(ISBLANK('FY22-23 Work Plan'!$J$18:$J$18),\"\",'FY22-23 Work Plan'!$J$18:$J$18)","v":"j.doe@preventionusa.com"},{"$f":"IF(ISBLANK('FY22-23 Work Plan'!$E$19:$E$19),\"\",'FY22-23 Work Plan'!$E$19:$E$19)","v":"John/Jane Doe"},{"$f":"IF(ISBLANK('FY22-23 Work Plan'!$H$19:$H$19),\"\",TEXT('FY22-23 Work Plan'!$H$19:$H$19,\"###-###-####\"))","v":"213-555-1213"},{"$f":"IF(ISBLANK('FY22-23 Work Plan'!$J$19:$J$19),\"\",'FY22-23 Work Plan'!$J$19:$J$19)","v":"j.doe@preventionusa.com"},{"$f":"IF(ISBLANK('FY22-23 Work Plan'!$D$23:$D$23),\"\",'FY22-23 Work Plan'!$D$23:$D$23)","v":""},{"$f":"IF(ISBLANK('FY22-23 Work Plan'!$H$23:$H$23),\"\",'FY22-23 Work Plan'!$H$23:$H$23)","v":""},{"$f":"IF(ISBLANK('FY22-23 Work Plan'!$D$24:$D$24),\"\",'FY22-23 Work Plan'!$D$24:$D$24)","v":""},{"$f":"IF(ISBLANK('FY22-23 Work Plan'!$H$24:$H$24),\"\",'FY22-23 Work Plan'!$H$24:$H$24)","v":""},{"$f":"IF(ISBLANK('FY22-23 Work Plan'!$D$25:$D$25),\"\",'FY22-23 Work Plan'!$D$25:$D$25)","v":""},{"$f":"IF(ISBLANK('FY22-23 Work Plan'!$H$25:$H$25),\"\",'FY22-23 Work Plan'!$H$25:$H$25)","v":""},{"$f":"IF(ISBLANK('FY22-23 Work Plan'!$D$26:$D$26),\"\",'FY22-23 Work Plan'!$D$26:$D$26)","v":""},{"$f":"IF(ISBLANK('FY22-23 Work Plan'!$H$26:$H$26),\"\",'FY22-23 Work Plan'!$H$26:$H$26)","v":""},{"$f":"IF(ISBLANK('FY22-23 Work Plan'!$D$27:$D$27),\"\",'FY22-23 Work Plan'!$D$27:$D$27)","v":""},{"$f":"IF(ISBLANK('FY22-23 Work Plan'!$H$27:$H$27),\"\",'FY22-23 Work Plan'!$H$27:$H$27)","v":""},{"$f":"IF(ISBLANK('FY22-23 Work Plan'!$D$28:$D$28),\"\",'FY22-23 Work Plan'!$D$28:$D$28)","v":""},{"$f":"IF(ISBLANK('FY22-23 Work Plan'!$H$28:$H$28),\"\",'FY22-23 Work Plan'!$H$28:$H$28)","v":""},{"$f":"IF(ISBLANK('FY22-23 Work Plan'!$D$29:$D$29),\"\",'FY22-23 Work Plan'!$D$29:$D$29)","v":""},{"$f":"IF(ISBLANK('FY22-23 Work Plan'!$H$29:$H$29),\"\",'FY22-23 Work Plan'!$H$29:$H$29)","v":""},{"$f":"IF(ISBLANK('FY22-23 Work Plan'!$B$30:$B$30),\"\",'FY22-23 Work Plan'!$B$30:$B$30)","v":""},{"$f":"IF(ISBLANK('FY22-23 Work Plan'!$D$30:$D$30),\"\",'FY22-23 Work Plan'!$D$30:$D$30)","v":""},{"$f":"IF(ISBLANK('FY22-23 Work Plan'!$H$30:$H$30),\"\",'FY22-23 Work Plan'!$H$30:$H$30)","v":""},{"$f":"IF(ISBLANK('FY22-23 Work Plan'!$B$31:$B$31),\"\",'FY22-23 Work Plan'!$B$31:$B$31)","v":""},{"$f":"IF(ISBLANK('FY22-23 Work Plan'!$D$31:$D$31),\"\",'FY22-23 Work Plan'!$D$31:$D$31)","v":""},{"$f":"IF(ISBLANK('FY22-23 Work Plan'!$H$31:$H$31),\"\",'FY22-23 Work Plan'!$H$31:$H$31)","v":""},{"$f":"IF(ISBLANK('FY22-23 Work Plan'!$B$32:$B$32),\"\",'FY22-23 Work Plan'!$B$32:$B$32)","v":""},{"$f":"IF(ISBLANK('FY22-23 Work Plan'!$D$32:$D$32),\"\",'FY22-23 Work Plan'!$D$32:$D$32)","v":""},{"$f":"IF(ISBLANK('FY22-23 Work Plan'!$H$32:$H$32),\"\",'FY22-23 Work Plan'!$H$32:$H$32)","v":""},{"$f":"IF(ISBLANK('FY22-23 Work Plan'!A77),\"\",'FY22-23 Work Plan'!A77)","v":""},{"$f":"IF(ISBLANK('FY22-23 Work Plan'!D77),\"\",'FY22-23 Work Plan'!D77)","v":""},{"$f":"IF(ISBLANK('FY22-23 Work Plan'!E77),\"\",'FY22-23 Work Plan'!E77)","v":""},{"$f":"IF(ISBLANK('FY22-23 Work Plan'!F77),\"\",'FY22-23 Work Plan'!F77)","v":""},{"$f":"IF(ISBLANK('FY22-23 Work Plan'!H77),\"\",'FY22-23 Work Plan'!H77)","v":""},{"$f":"IF(ISBLANK('FY22-23 Work Plan'!I77),\"\",'FY22-23 Work Plan'!I77)","v":""},{"$f":"IF(ISBLANK('FY22-23 Work Plan'!J77),\"\",'FY22-23 Work Plan'!J77)","v":""},{"$f":"IF(ISBLANK('FY22-23 Work Plan'!K77),\"\",'FY22-23 Work Plan'!K77)","v":""},{"$f":"IF(ISBLANK('FY22-23 Work Plan'!L77),\"\",'FY22-23 Work Plan'!L77)","v":""}]
[{"$f":"IF(ISBLANK('FY22-23 Work Plan'!$E$2:$E$2),\"\",'FY22-23 Work Plan'!$E$2:$E$2)","v":"Asian American Drug Abuse Programs, Inc. (AADAP)"},{"$f":"IF(ISBLANK('FY22-23 Work Plan'!$J$2:$J$2),\"\",'FY22-23 Work Plan'!$J$2:$J$2)","v":"Prevention Education Program (PEP)"},{"$f":"IF(ISBLANK('FY22-23 Work Plan'!$J$3:$J$3),\"\",'FY22-23 Work Plan'!$J$3:$J$3)","v":""},{"$f":"IF(ISBLANK('FY22-23 Work Plan'!$E$3:$E$3),\"\",'FY22-23 Work Plan'!$E$3:$E$3)","v":"PH-004367"},{"$f":"IF(ISBLANK('FY22-23 Work Plan'!$E$4:$E$4),\"\",TEXT('FY22-23 Work Plan'!$E$4:$E$4,\"000000\"))","v":"000001"},{"$f":"IF(ISBLANK('FY22-23 Work Plan'!$J$4:$J$4),\"\",'FY22-23 Work Plan'!$J$4:$J$4)","v":"Building Skills"},{"$f":"IF(ISBLANK('FY22-23 Work Plan'!$E$5:$E$5),\"\",'FY22-23 Work Plan'!$E$5:$E$5)","v":"2 - San Fernando Valley"},{"$f":"IF(ISBLANK('FY22-23 Work Plan'!$J$5:$J$5),\"\",'FY22-23 Work Plan'!$J$5:$J$5)","v":"3rd District, 4th District"},{"$f":"IF(ISBLANK('FY22-23 Work Plan'!$E$6:$E$6),\"\",'FY22-23 Work Plan'!$E$6:$E$6)","v":"Angeles National Forest*, Artesia, Altadena*"},{"$f":"IF(ISBLANK('FY22-23 Work Plan'!$E$7:$E$7),\"\",'FY22-23 Work Plan'!$E$7:$E$7)","v":"Cadillac-Corning, Angeles National Forest"},{"$f":"IF(ISBLANK('FY22-23 Work Plan'!$E$8:$E$8),\"\",'FY22-23 Work Plan'!$E$8:$E$8)","v":"90032, 90036"},{"$f":"IF(ISBLANK('FY22-23 Work Plan'!$E$9:$E$9),\"\",'FY22-23 Work Plan'!$E$9:$E$9)","v":"123 E Main St., Suite 100 \nAnytown, CA 90000"},{"$f":"IF(ISBLANK('FY22-23 Work Plan'!$J$9:$J$9),\"\",TEXT('FY22-23 Work Plan'!$J$9:$J$9,\"###-###-####\"))","v":"999-999-9999"},{"$f":"IF(ISBLANK('FY22-23 Work Plan'!$J$10:$J$10),\"\",'FY22-23 Work Plan'!$J$10:$J$10)","v":"www.abc1.org"},{"$f":"IF(ISBLANK('FY22-23 Work Plan'!$E$11:$E$11),\"\",'FY22-23 Work Plan'!$E$11:$E$11)","v":"123 E Main St., Suite 100 \nAnytown, CA 90000"},{"$f":"IF(ISBLANK('FY22-23 Work Plan'!$J$11:$J$11),\"\",TEXT('FY22-23 Work Plan'!$J$11:$J$11,\"###-###-####\"))","v":"999-999-9999"},{"$f":"IF(ISBLANK('FY22-23 Work Plan'!$J$12:$J$12),\"\",'FY22-23 Work Plan'!$J$12:$J$12)","v":"www.abc2.org"},{"$f":"IF(ISBLANK('FY22-23 Work Plan'!$E$15:$E$15),\"\",'FY22-23 Work Plan'!$E$15:$E$15)","v":"John/Jane Doe"},{"$f":"IF(ISBLANK('FY22-23 Work Plan'!$H$15:$H$15),\"\",TEXT('FY22-23 Work Plan'!$H$15:$H$15,\"###-###-####\"))","v":"213-555-1212"},{"$f":"IF(ISBLANK('FY22-23 Work Plan'!$J$15:$J$15),\"\",'FY22-23 Work Plan'!$J$15:$J$15)","v":"janedoe@preventionusa.com"},{"$f":"IF(ISBLANK('FY22-23 Work Plan'!$E$16:$E$16),\"\",'FY22-23 Work Plan'!$E$16:$E$16)","v":"John/Jane Doe"},{"$f":"IF(ISBLANK('FY22-23 Work Plan'!$H$16:$H$16),\"\",TEXT('FY22-23 Work Plan'!$H$16:$H$16,\"###-###-####\"))","v":"213-555-1212"},{"$f":"IF(ISBLANK('FY22-23 Work Plan'!$J$16:$J$16),\"\",'FY22-23 Work Plan'!$J$16:$J$16)","v":"janedoe@preventionusa.com"},{"$f":"IF(ISBLANK('FY22-23 Work Plan'!$E$17:$E$17),\"\",'FY22-23 Work Plan'!$E$17:$E$17)","v":"John/Jane Doe"},{"$f":"IF(ISBLANK('FY22-23 Work Plan'!$H$17:$H$17),\"\",TEXT('FY22-23 Work Plan'!$H$17:$H$17,\"###-###-####\"))","v":"213-555-1212"},{"$f":"IF(ISBLANK('FY22-23 Work Plan'!$J$17:$J$17),\"\",'FY22-23 Work Plan'!$J$17:$J$17)","v":"j.doe@preventionusa.com"},{"$f":"IF(ISBLANK('FY22-23 Work Plan'!$E$18:$E$18),\"\",'FY22-23 Work Plan'!$E$18:$E$18)","v":"John/Jane Doe"},{"$f":"IF(ISBLANK('FY22-23 Work Plan'!$H$18:$H$18),\"\",TEXT('FY22-23 Work Plan'!$H$18:$H$18,\"###-###-####\"))","v":"213-555-1213"},{"$f":"IF(ISBLANK('FY22-23 Work Plan'!$J$18:$J$18),\"\",'FY22-23 Work Plan'!$J$18:$J$18)","v":"j.doe@preventionusa.com"},{"$f":"IF(ISBLANK('FY22-23 Work Plan'!$E$19:$E$19),\"\",'FY22-23 Work Plan'!$E$19:$E$19)","v":"John/Jane Doe"},{"$f":"IF(ISBLANK('FY22-23 Work Plan'!$H$19:$H$19),\"\",TEXT('FY22-23 Work Plan'!$H$19:$H$19,\"###-###-####\"))","v":"213-555-1213"},{"$f":"IF(ISBLANK('FY22-23 Work Plan'!$J$19:$J$19),\"\",'FY22-23 Work Plan'!$J$19:$J$19)","v":"j.doe@preventionusa.com"},{"$f":"IF(ISBLANK('FY22-23 Work Plan'!$D$23:$D$23),\"\",'FY22-23 Work Plan'!$D$23:$D$23)","v":""},{"$f":"IF(ISBLANK('FY22-23 Work Plan'!$H$23:$H$23),\"\",'FY22-23 Work Plan'!$H$23:$H$23)","v":""},{"$f":"IF(ISBLANK('FY22-23 Work Plan'!$D$24:$D$24),\"\",'FY22-23 Work Plan'!$D$24:$D$24)","v":""},{"$f":"IF(ISBLANK('FY22-23 Work Plan'!$H$24:$H$24),\"\",'FY22-23 Work Plan'!$H$24:$H$24)","v":""},{"$f":"IF(ISBLANK('FY22-23 Work Plan'!$D$25:$D$25),\"\",'FY22-23 Work Plan'!$D$25:$D$25)","v":""},{"$f":"IF(ISBLANK('FY22-23 Work Plan'!$H$25:$H$25),\"\",'FY22-23 Work Plan'!$H$25:$H$25)","v":""},{"$f":"IF(ISBLANK('FY22-23 Work Plan'!$D$26:$D$26),\"\",'FY22-23 Work Plan'!$D$26:$D$26)","v":""},{"$f":"IF(ISBLANK('FY22-23 Work Plan'!$H$26:$H$26),\"\",'FY22-23 Work Plan'!$H$26:$H$26)","v":""},{"$f":"IF(ISBLANK('FY22-23 Work Plan'!$D$27:$D$27),\"\",'FY22-23 Work Plan'!$D$27:$D$27)","v":""},{"$f":"IF(ISBLANK('FY22-23 Work Plan'!$H$27:$H$27),\"\",'FY22-23 Work Plan'!$H$27:$H$27)","v":""},{"$f":"IF(ISBLANK('FY22-23 Work Plan'!$D$28:$D$28),\"\",'FY22-23 Work Plan'!$D$28:$D$28)","v":""},{"$f":"IF(ISBLANK('FY22-23 Work Plan'!$H$28:$H$28),\"\",'FY22-23 Work Plan'!$H$28:$H$28)","v":""},{"$f":"IF(ISBLANK('FY22-23 Work Plan'!$D$29:$D$29),\"\",'FY22-23 Work Plan'!$D$29:$D$29)","v":""},{"$f":"IF(ISBLANK('FY22-23 Work Plan'!$H$29:$H$29),\"\",'FY22-23 Work Plan'!$H$29:$H$29)","v":""},{"$f":"IF(ISBLANK('FY22-23 Work Plan'!$B$30:$B$30),\"\",'FY22-23 Work Plan'!$B$30:$B$30)","v":""},{"$f":"IF(ISBLANK('FY22-23 Work Plan'!$D$30:$D$30),\"\",'FY22-23 Work Plan'!$D$30:$D$30)","v":""},{"$f":"IF(ISBLANK('FY22-23 Work Plan'!$H$30:$H$30),\"\",'FY22-23 Work Plan'!$H$30:$H$30)","v":""},{"$f":"IF(ISBLANK('FY22-23 Work Plan'!$B$31:$B$31),\"\",'FY22-23 Work Plan'!$B$31:$B$31)","v":""},{"$f":"IF(ISBLANK('FY22-23 Work Plan'!$D$31:$D$31),\"\",'FY22-23 Work Plan'!$D$31:$D$31)","v":""},{"$f":"IF(ISBLANK('FY22-23 Work Plan'!$H$31:$H$31),\"\",'FY22-23 Work Plan'!$H$31:$H$31)","v":""},{"$f":"IF(ISBLANK('FY22-23 Work Plan'!$B$32:$B$32),\"\",'FY22-23 Work Plan'!$B$32:$B$32)","v":""},{"$f":"IF(ISBLANK('FY22-23 Work Plan'!$D$32:$D$32),\"\",'FY22-23 Work Plan'!$D$32:$D$32)","v":""},{"$f":"IF(ISBLANK('FY22-23 Work Plan'!$H$32:$H$32),\"\",'FY22-23 Work Plan'!$H$32:$H$32)","v":""},{"$f":"IF(ISBLANK('FY22-23 Work Plan'!A78),\"\",'FY22-23 Work Plan'!A78)","v":""},{"$f":"IF(ISBLANK('FY22-23 Work Plan'!D78),\"\",'FY22-23 Work Plan'!D78)","v":""},{"$f":"IF(ISBLANK('FY22-23 Work Plan'!E78),\"\",'FY22-23 Work Plan'!E78)","v":""},{"$f":"IF(ISBLANK('FY22-23 Work Plan'!F78),\"\",'FY22-23 Work Plan'!F78)","v":""},{"$f":"IF(ISBLANK('FY22-23 Work Plan'!H78),\"\",'FY22-23 Work Plan'!H78)","v":""},{"$f":"IF(ISBLANK('FY22-23 Work Plan'!I78),\"\",'FY22-23 Work Plan'!I78)","v":""},{"$f":"IF(ISBLANK('FY22-23 Work Plan'!J78),\"\",'FY22-23 Work Plan'!J78)","v":""},{"$f":"IF(ISBLANK('FY22-23 Work Plan'!K78),\"\",'FY22-23 Work Plan'!K78)","v":""},{"$f":"IF(ISBLANK('FY22-23 Work Plan'!L78),\"\",'FY22-23 Work Plan'!L78)","v":""}]
[{"$f":"IF(ISBLANK('FY22-23 Work Plan'!$E$2:$E$2),\"\",'FY22-23 Work Plan'!$E$2:$E$2)","v":"Asian American Drug Abuse Programs, Inc. (AADAP)"},{"$f":"IF(ISBLANK('FY22-23 Work Plan'!$J$2:$J$2),\"\",'FY22-23 Work Plan'!$J$2:$J$2)","v":"Prevention Education Program (PEP)"},{"$f":"IF(ISBLANK('FY22-23 Work Plan'!$J$3:$J$3),\"\",'FY22-23 Work Plan'!$J$3:$J$3)","v":""},{"$f":"IF(ISBLANK('FY22-23 Work Plan'!$E$3:$E$3),\"\",'FY22-23 Work Plan'!$E$3:$E$3)","v":"PH-004367"},{"$f":"IF(ISBLANK('FY22-23 Work Plan'!$E$4:$E$4),\"\",TEXT('FY22-23 Work Plan'!$E$4:$E$4,\"000000\"))","v":"000001"},{"$f":"IF(ISBLANK('FY22-23 Work Plan'!$J$4:$J$4),\"\",'FY22-23 Work Plan'!$J$4:$J$4)","v":"Building Skills"},{"$f":"IF(ISBLANK('FY22-23 Work Plan'!$E$5:$E$5),\"\",'FY22-23 Work Plan'!$E$5:$E$5)","v":"2 - San Fernando Valley"},{"$f":"IF(ISBLANK('FY22-23 Work Plan'!$J$5:$J$5),\"\",'FY22-23 Work Plan'!$J$5:$J$5)","v":"3rd District, 4th District"},{"$f":"IF(ISBLANK('FY22-23 Work Plan'!$E$6:$E$6),\"\",'FY22-23 Work Plan'!$E$6:$E$6)","v":"Angeles National Forest*, Artesia, Altadena*"},{"$f":"IF(ISBLANK('FY22-23 Work Plan'!$E$7:$E$7),\"\",'FY22-23 Work Plan'!$E$7:$E$7)","v":"Cadillac-Corning, Angeles National Forest"},{"$f":"IF(ISBLANK('FY22-23 Work Plan'!$E$8:$E$8),\"\",'FY22-23 Work Plan'!$E$8:$E$8)","v":"90032, 90036"},{"$f":"IF(ISBLANK('FY22-23 Work Plan'!$E$9:$E$9),\"\",'FY22-23 Work Plan'!$E$9:$E$9)","v":"123 E Main St., Suite 100 \nAnytown, CA 90000"},{"$f":"IF(ISBLANK('FY22-23 Work Plan'!$J$9:$J$9),\"\",TEXT('FY22-23 Work Plan'!$J$9:$J$9,\"###-###-####\"))","v":"999-999-9999"},{"$f":"IF(ISBLANK('FY22-23 Work Plan'!$J$10:$J$10),\"\",'FY22-23 Work Plan'!$J$10:$J$10)","v":"www.abc1.org"},{"$f":"IF(ISBLANK('FY22-23 Work Plan'!$E$11:$E$11),\"\",'FY22-23 Work Plan'!$E$11:$E$11)","v":"123 E Main St., Suite 100 \nAnytown, CA 90000"},{"$f":"IF(ISBLANK('FY22-23 Work Plan'!$J$11:$J$11),\"\",TEXT('FY22-23 Work Plan'!$J$11:$J$11,\"###-###-####\"))","v":"999-999-9999"},{"$f":"IF(ISBLANK('FY22-23 Work Plan'!$J$12:$J$12),\"\",'FY22-23 Work Plan'!$J$12:$J$12)","v":"www.abc2.org"},{"$f":"IF(ISBLANK('FY22-23 Work Plan'!$E$15:$E$15),\"\",'FY22-23 Work Plan'!$E$15:$E$15)","v":"John/Jane Doe"},{"$f":"IF(ISBLANK('FY22-23 Work Plan'!$H$15:$H$15),\"\",TEXT('FY22-23 Work Plan'!$H$15:$H$15,\"###-###-####\"))","v":"213-555-1212"},{"$f":"IF(ISBLANK('FY22-23 Work Plan'!$J$15:$J$15),\"\",'FY22-23 Work Plan'!$J$15:$J$15)","v":"janedoe@preventionusa.com"},{"$f":"IF(ISBLANK('FY22-23 Work Plan'!$E$16:$E$16),\"\",'FY22-23 Work Plan'!$E$16:$E$16)","v":"John/Jane Doe"},{"$f":"IF(ISBLANK('FY22-23 Work Plan'!$H$16:$H$16),\"\",TEXT('FY22-23 Work Plan'!$H$16:$H$16,\"###-###-####\"))","v":"213-555-1212"},{"$f":"IF(ISBLANK('FY22-23 Work Plan'!$J$16:$J$16),\"\",'FY22-23 Work Plan'!$J$16:$J$16)","v":"janedoe@preventionusa.com"},{"$f":"IF(ISBLANK('FY22-23 Work Plan'!$E$17:$E$17),\"\",'FY22-23 Work Plan'!$E$17:$E$17)","v":"John/Jane Doe"},{"$f":"IF(ISBLANK('FY22-23 Work Plan'!$H$17:$H$17),\"\",TEXT('FY22-23 Work Plan'!$H$17:$H$17,\"###-###-####\"))","v":"213-555-1212"},{"$f":"IF(ISBLANK('FY22-23 Work Plan'!$J$17:$J$17),\"\",'FY22-23 Work Plan'!$J$17:$J$17)","v":"j.doe@preventionusa.com"},{"$f":"IF(ISBLANK('FY22-23 Work Plan'!$E$18:$E$18),\"\",'FY22-23 Work Plan'!$E$18:$E$18)","v":"John/Jane Doe"},{"$f":"IF(ISBLANK('FY22-23 Work Plan'!$H$18:$H$18),\"\",TEXT('FY22-23 Work Plan'!$H$18:$H$18,\"###-###-####\"))","v":"213-555-1213"},{"$f":"IF(ISBLANK('FY22-23 Work Plan'!$J$18:$J$18),\"\",'FY22-23 Work Plan'!$J$18:$J$18)","v":"j.doe@preventionusa.com"},{"$f":"IF(ISBLANK('FY22-23 Work Plan'!$E$19:$E$19),\"\",'FY22-23 Work Plan'!$E$19:$E$19)","v":"John/Jane Doe"},{"$f":"IF(ISBLANK('FY22-23 Work Plan'!$H$19:$H$19),\"\",TEXT('FY22-23 Work Plan'!$H$19:$H$19,\"###-###-####\"))","v":"213-555-1213"},{"$f":"IF(ISBLANK('FY22-23 Work Plan'!$J$19:$J$19),\"\",'FY22-23 Work Plan'!$J$19:$J$19)","v":"j.doe@preventionusa.com"},{"$f":"IF(ISBLANK('FY22-23 Work Plan'!$D$23:$D$23),\"\",'FY22-23 Work Plan'!$D$23:$D$23)","v":""},{"$f":"IF(ISBLANK('FY22-23 Work Plan'!$H$23:$H$23),\"\",'FY22-23 Work Plan'!$H$23:$H$23)","v":""},{"$f":"IF(ISBLANK('FY22-23 Work Plan'!$D$24:$D$24),\"\",'FY22-23 Work Plan'!$D$24:$D$24)","v":""},{"$f":"IF(ISBLANK('FY22-23 Work Plan'!$H$24:$H$24),\"\",'FY22-23 Work Plan'!$H$24:$H$24)","v":""},{"$f":"IF(ISBLANK('FY22-23 Work Plan'!$D$25:$D$25),\"\",'FY22-23 Work Plan'!$D$25:$D$25)","v":""},{"$f":"IF(ISBLANK('FY22-23 Work Plan'!$H$25:$H$25),\"\",'FY22-23 Work Plan'!$H$25:$H$25)","v":""},{"$f":"IF(ISBLANK('FY22-23 Work Plan'!$D$26:$D$26),\"\",'FY22-23 Work Plan'!$D$26:$D$26)","v":""},{"$f":"IF(ISBLANK('FY22-23 Work Plan'!$H$26:$H$26),\"\",'FY22-23 Work Plan'!$H$26:$H$26)","v":""},{"$f":"IF(ISBLANK('FY22-23 Work Plan'!$D$27:$D$27),\"\",'FY22-23 Work Plan'!$D$27:$D$27)","v":""},{"$f":"IF(ISBLANK('FY22-23 Work Plan'!$H$27:$H$27),\"\",'FY22-23 Work Plan'!$H$27:$H$27)","v":""},{"$f":"IF(ISBLANK('FY22-23 Work Plan'!$D$28:$D$28),\"\",'FY22-23 Work Plan'!$D$28:$D$28)","v":""},{"$f":"IF(ISBLANK('FY22-23 Work Plan'!$H$28:$H$28),\"\",'FY22-23 Work Plan'!$H$28:$H$28)","v":""},{"$f":"IF(ISBLANK('FY22-23 Work Plan'!$D$29:$D$29),\"\",'FY22-23 Work Plan'!$D$29:$D$29)","v":""},{"$f":"IF(ISBLANK('FY22-23 Work Plan'!$H$29:$H$29),\"\",'FY22-23 Work Plan'!$H$29:$H$29)","v":""},{"$f":"IF(ISBLANK('FY22-23 Work Plan'!$B$30:$B$30),\"\",'FY22-23 Work Plan'!$B$30:$B$30)","v":""},{"$f":"IF(ISBLANK('FY22-23 Work Plan'!$D$30:$D$30),\"\",'FY22-23 Work Plan'!$D$30:$D$30)","v":""},{"$f":"IF(ISBLANK('FY22-23 Work Plan'!$H$30:$H$30),\"\",'FY22-23 Work Plan'!$H$30:$H$30)","v":""},{"$f":"IF(ISBLANK('FY22-23 Work Plan'!$B$31:$B$31),\"\",'FY22-23 Work Plan'!$B$31:$B$31)","v":""},{"$f":"IF(ISBLANK('FY22-23 Work Plan'!$D$31:$D$31),\"\",'FY22-23 Work Plan'!$D$31:$D$31)","v":""},{"$f":"IF(ISBLANK('FY22-23 Work Plan'!$H$31:$H$31),\"\",'FY22-23 Work Plan'!$H$31:$H$31)","v":""},{"$f":"IF(ISBLANK('FY22-23 Work Plan'!$B$32:$B$32),\"\",'FY22-23 Work Plan'!$B$32:$B$32)","v":""},{"$f":"IF(ISBLANK('FY22-23 Work Plan'!$D$32:$D$32),\"\",'FY22-23 Work Plan'!$D$32:$D$32)","v":""},{"$f":"IF(ISBLANK('FY22-23 Work Plan'!$H$32:$H$32),\"\",'FY22-23 Work Plan'!$H$32:$H$32)","v":""},{"$f":"IF(ISBLANK('FY22-23 Work Plan'!A79),\"\",'FY22-23 Work Plan'!A79)","v":""},{"$f":"IF(ISBLANK('FY22-23 Work Plan'!D79),\"\",'FY22-23 Work Plan'!D79)","v":""},{"$f":"IF(ISBLANK('FY22-23 Work Plan'!E79),\"\",'FY22-23 Work Plan'!E79)","v":""},{"$f":"IF(ISBLANK('FY22-23 Work Plan'!F79),\"\",'FY22-23 Work Plan'!F79)","v":""},{"$f":"IF(ISBLANK('FY22-23 Work Plan'!H79),\"\",'FY22-23 Work Plan'!H79)","v":""},{"$f":"IF(ISBLANK('FY22-23 Work Plan'!I79),\"\",'FY22-23 Work Plan'!I79)","v":""},{"$f":"IF(ISBLANK('FY22-23 Work Plan'!J79),\"\",'FY22-23 Work Plan'!J79)","v":""},{"$f":"IF(ISBLANK('FY22-23 Work Plan'!K79),\"\",'FY22-23 Work Plan'!K79)","v":""},{"$f":"IF(ISBLANK('FY22-23 Work Plan'!L79),\"\",'FY22-23 Work Plan'!L79)","v":""}]
[{"$f":"IF(ISBLANK('FY22-23 Work Plan'!$E$2:$E$2),\"\",'FY22-23 Work Plan'!$E$2:$E$2)","v":"Asian American Drug Abuse Programs, Inc. (AADAP)"},{"$f":"IF(ISBLANK('FY22-23 Work Plan'!$J$2:$J$2),\"\",'FY22-23 Work Plan'!$J$2:$J$2)","v":"Prevention Education Program (PEP)"},{"$f":"IF(ISBLANK('FY22-23 Work Plan'!$J$3:$J$3),\"\",'FY22-23 Work Plan'!$J$3:$J$3)","v":""},{"$f":"IF(ISBLANK('FY22-23 Work Plan'!$E$3:$E$3),\"\",'FY22-23 Work Plan'!$E$3:$E$3)","v":"PH-004367"},{"$f":"IF(ISBLANK('FY22-23 Work Plan'!$E$4:$E$4),\"\",TEXT('FY22-23 Work Plan'!$E$4:$E$4,\"000000\"))","v":"000001"},{"$f":"IF(ISBLANK('FY22-23 Work Plan'!$J$4:$J$4),\"\",'FY22-23 Work Plan'!$J$4:$J$4)","v":"Building Skills"},{"$f":"IF(ISBLANK('FY22-23 Work Plan'!$E$5:$E$5),\"\",'FY22-23 Work Plan'!$E$5:$E$5)","v":"2 - San Fernando Valley"},{"$f":"IF(ISBLANK('FY22-23 Work Plan'!$J$5:$J$5),\"\",'FY22-23 Work Plan'!$J$5:$J$5)","v":"3rd District, 4th District"},{"$f":"IF(ISBLANK('FY22-23 Work Plan'!$E$6:$E$6),\"\",'FY22-23 Work Plan'!$E$6:$E$6)","v":"Angeles National Forest*, Artesia, Altadena*"},{"$f":"IF(ISBLANK('FY22-23 Work Plan'!$E$7:$E$7),\"\",'FY22-23 Work Plan'!$E$7:$E$7)","v":"Cadillac-Corning, Angeles National Forest"},{"$f":"IF(ISBLANK('FY22-23 Work Plan'!$E$8:$E$8),\"\",'FY22-23 Work Plan'!$E$8:$E$8)","v":"90032, 90036"},{"$f":"IF(ISBLANK('FY22-23 Work Plan'!$E$9:$E$9),\"\",'FY22-23 Work Plan'!$E$9:$E$9)","v":"123 E Main St., Suite 100 \nAnytown, CA 90000"},{"$f":"IF(ISBLANK('FY22-23 Work Plan'!$J$9:$J$9),\"\",TEXT('FY22-23 Work Plan'!$J$9:$J$9,\"###-###-####\"))","v":"999-999-9999"},{"$f":"IF(ISBLANK('FY22-23 Work Plan'!$J$10:$J$10),\"\",'FY22-23 Work Plan'!$J$10:$J$10)","v":"www.abc1.org"},{"$f":"IF(ISBLANK('FY22-23 Work Plan'!$E$11:$E$11),\"\",'FY22-23 Work Plan'!$E$11:$E$11)","v":"123 E Main St., Suite 100 \nAnytown, CA 90000"},{"$f":"IF(ISBLANK('FY22-23 Work Plan'!$J$11:$J$11),\"\",TEXT('FY22-23 Work Plan'!$J$11:$J$11,\"###-###-####\"))","v":"999-999-9999"},{"$f":"IF(ISBLANK('FY22-23 Work Plan'!$J$12:$J$12),\"\",'FY22-23 Work Plan'!$J$12:$J$12)","v":"www.abc2.org"},{"$f":"IF(ISBLANK('FY22-23 Work Plan'!$E$15:$E$15),\"\",'FY22-23 Work Plan'!$E$15:$E$15)","v":"John/Jane Doe"},{"$f":"IF(ISBLANK('FY22-23 Work Plan'!$H$15:$H$15),\"\",TEXT('FY22-23 Work Plan'!$H$15:$H$15,\"###-###-####\"))","v":"213-555-1212"},{"$f":"IF(ISBLANK('FY22-23 Work Plan'!$J$15:$J$15),\"\",'FY22-23 Work Plan'!$J$15:$J$15)","v":"janedoe@preventionusa.com"},{"$f":"IF(ISBLANK('FY22-23 Work Plan'!$E$16:$E$16),\"\",'FY22-23 Work Plan'!$E$16:$E$16)","v":"John/Jane Doe"},{"$f":"IF(ISBLANK('FY22-23 Work Plan'!$H$16:$H$16),\"\",TEXT('FY22-23 Work Plan'!$H$16:$H$16,\"###-###-####\"))","v":"213-555-1212"},{"$f":"IF(ISBLANK('FY22-23 Work Plan'!$J$16:$J$16),\"\",'FY22-23 Work Plan'!$J$16:$J$16)","v":"janedoe@preventionusa.com"},{"$f":"IF(ISBLANK('FY22-23 Work Plan'!$E$17:$E$17),\"\",'FY22-23 Work Plan'!$E$17:$E$17)","v":"John/Jane Doe"},{"$f":"IF(ISBLANK('FY22-23 Work Plan'!$H$17:$H$17),\"\",TEXT('FY22-23 Work Plan'!$H$17:$H$17,\"###-###-####\"))","v":"213-555-1212"},{"$f":"IF(ISBLANK('FY22-23 Work Plan'!$J$17:$J$17),\"\",'FY22-23 Work Plan'!$J$17:$J$17)","v":"j.doe@preventionusa.com"},{"$f":"IF(ISBLANK('FY22-23 Work Plan'!$E$18:$E$18),\"\",'FY22-23 Work Plan'!$E$18:$E$18)","v":"John/Jane Doe"},{"$f":"IF(ISBLANK('FY22-23 Work Plan'!$H$18:$H$18),\"\",TEXT('FY22-23 Work Plan'!$H$18:$H$18,\"###-###-####\"))","v":"213-555-1213"},{"$f":"IF(ISBLANK('FY22-23 Work Plan'!$J$18:$J$18),\"\",'FY22-23 Work Plan'!$J$18:$J$18)","v":"j.doe@preventionusa.com"},{"$f":"IF(ISBLANK('FY22-23 Work Plan'!$E$19:$E$19),\"\",'FY22-23 Work Plan'!$E$19:$E$19)","v":"John/Jane Doe"},{"$f":"IF(ISBLANK('FY22-23 Work Plan'!$H$19:$H$19),\"\",TEXT('FY22-23 Work Plan'!$H$19:$H$19,\"###-###-####\"))","v":"213-555-1213"},{"$f":"IF(ISBLANK('FY22-23 Work Plan'!$J$19:$J$19),\"\",'FY22-23 Work Plan'!$J$19:$J$19)","v":"j.doe@preventionusa.com"},{"$f":"IF(ISBLANK('FY22-23 Work Plan'!$D$23:$D$23),\"\",'FY22-23 Work Plan'!$D$23:$D$23)","v":""},{"$f":"IF(ISBLANK('FY22-23 Work Plan'!$H$23:$H$23),\"\",'FY22-23 Work Plan'!$H$23:$H$23)","v":""},{"$f":"IF(ISBLANK('FY22-23 Work Plan'!$D$24:$D$24),\"\",'FY22-23 Work Plan'!$D$24:$D$24)","v":""},{"$f":"IF(ISBLANK('FY22-23 Work Plan'!$H$24:$H$24),\"\",'FY22-23 Work Plan'!$H$24:$H$24)","v":""},{"$f":"IF(ISBLANK('FY22-23 Work Plan'!$D$25:$D$25),\"\",'FY22-23 Work Plan'!$D$25:$D$25)","v":""},{"$f":"IF(ISBLANK('FY22-23 Work Plan'!$H$25:$H$25),\"\",'FY22-23 Work Plan'!$H$25:$H$25)","v":""},{"$f":"IF(ISBLANK('FY22-23 Work Plan'!$D$26:$D$26),\"\",'FY22-23 Work Plan'!$D$26:$D$26)","v":""},{"$f":"IF(ISBLANK('FY22-23 Work Plan'!$H$26:$H$26),\"\",'FY22-23 Work Plan'!$H$26:$H$26)","v":""},{"$f":"IF(ISBLANK('FY22-23 Work Plan'!$D$27:$D$27),\"\",'FY22-23 Work Plan'!$D$27:$D$27)","v":""},{"$f":"IF(ISBLANK('FY22-23 Work Plan'!$H$27:$H$27),\"\",'FY22-23 Work Plan'!$H$27:$H$27)","v":""},{"$f":"IF(ISBLANK('FY22-23 Work Plan'!$D$28:$D$28),\"\",'FY22-23 Work Plan'!$D$28:$D$28)","v":""},{"$f":"IF(ISBLANK('FY22-23 Work Plan'!$H$28:$H$28),\"\",'FY22-23 Work Plan'!$H$28:$H$28)","v":""},{"$f":"IF(ISBLANK('FY22-23 Work Plan'!$D$29:$D$29),\"\",'FY22-23 Work Plan'!$D$29:$D$29)","v":""},{"$f":"IF(ISBLANK('FY22-23 Work Plan'!$H$29:$H$29),\"\",'FY22-23 Work Plan'!$H$29:$H$29)","v":""},{"$f":"IF(ISBLANK('FY22-23 Work Plan'!$B$30:$B$30),\"\",'FY22-23 Work Plan'!$B$30:$B$30)","v":""},{"$f":"IF(ISBLANK('FY22-23 Work Plan'!$D$30:$D$30),\"\",'FY22-23 Work Plan'!$D$30:$D$30)","v":""},{"$f":"IF(ISBLANK('FY22-23 Work Plan'!$H$30:$H$30),\"\",'FY22-23 Work Plan'!$H$30:$H$30)","v":""},{"$f":"IF(ISBLANK('FY22-23 Work Plan'!$B$31:$B$31),\"\",'FY22-23 Work Plan'!$B$31:$B$31)","v":""},{"$f":"IF(ISBLANK('FY22-23 Work Plan'!$D$31:$D$31),\"\",'FY22-23 Work Plan'!$D$31:$D$31)","v":""},{"$f":"IF(ISBLANK('FY22-23 Work Plan'!$H$31:$H$31),\"\",'FY22-23 Work Plan'!$H$31:$H$31)","v":""},{"$f":"IF(ISBLANK('FY22-23 Work Plan'!$B$32:$B$32),\"\",'FY22-23 Work Plan'!$B$32:$B$32)","v":""},{"$f":"IF(ISBLANK('FY22-23 Work Plan'!$D$32:$D$32),\"\",'FY22-23 Work Plan'!$D$32:$D$32)","v":""},{"$f":"IF(ISBLANK('FY22-23 Work Plan'!$H$32:$H$32),\"\",'FY22-23 Work Plan'!$H$32:$H$32)","v":""},{"$f":"IF(ISBLANK('FY22-23 Work Plan'!A80),\"\",'FY22-23 Work Plan'!A80)","v":""},{"$f":"IF(ISBLANK('FY22-23 Work Plan'!D80),\"\",'FY22-23 Work Plan'!D80)","v":""},{"$f":"IF(ISBLANK('FY22-23 Work Plan'!E80),\"\",'FY22-23 Work Plan'!E80)","v":""},{"$f":"IF(ISBLANK('FY22-23 Work Plan'!F80),\"\",'FY22-23 Work Plan'!F80)","v":""},{"$f":"IF(ISBLANK('FY22-23 Work Plan'!H80),\"\",'FY22-23 Work Plan'!H80)","v":""},{"$f":"IF(ISBLANK('FY22-23 Work Plan'!I80),\"\",'FY22-23 Work Plan'!I80)","v":""},{"$f":"IF(ISBLANK('FY22-23 Work Plan'!J80),\"\",'FY22-23 Work Plan'!J80)","v":""},{"$f":"IF(ISBLANK('FY22-23 Work Plan'!K80),\"\",'FY22-23 Work Plan'!K80)","v":""},{"$f":"IF(ISBLANK('FY22-23 Work Plan'!L80),\"\",'FY22-23 Work Plan'!L80)","v":""}]
[{"$f":"IF(ISBLANK('FY22-23 Work Plan'!$E$2:$E$2),\"\",'FY22-23 Work Plan'!$E$2:$E$2)","v":"Asian American Drug Abuse Programs, Inc. (AADAP)"},{"$f":"IF(ISBLANK('FY22-23 Work Plan'!$J$2:$J$2),\"\",'FY22-23 Work Plan'!$J$2:$J$2)","v":"Prevention Education Program (PEP)"},{"$f":"IF(ISBLANK('FY22-23 Work Plan'!$J$3:$J$3),\"\",'FY22-23 Work Plan'!$J$3:$J$3)","v":""},{"$f":"IF(ISBLANK('FY22-23 Work Plan'!$E$3:$E$3),\"\",'FY22-23 Work Plan'!$E$3:$E$3)","v":"PH-004367"},{"$f":"IF(ISBLANK('FY22-23 Work Plan'!$E$4:$E$4),\"\",TEXT('FY22-23 Work Plan'!$E$4:$E$4,\"000000\"))","v":"000001"},{"$f":"IF(ISBLANK('FY22-23 Work Plan'!$J$4:$J$4),\"\",'FY22-23 Work Plan'!$J$4:$J$4)","v":"Building Skills"},{"$f":"IF(ISBLANK('FY22-23 Work Plan'!$E$5:$E$5),\"\",'FY22-23 Work Plan'!$E$5:$E$5)","v":"2 - San Fernando Valley"},{"$f":"IF(ISBLANK('FY22-23 Work Plan'!$J$5:$J$5),\"\",'FY22-23 Work Plan'!$J$5:$J$5)","v":"3rd District, 4th District"},{"$f":"IF(ISBLANK('FY22-23 Work Plan'!$E$6:$E$6),\"\",'FY22-23 Work Plan'!$E$6:$E$6)","v":"Angeles National Forest*, Artesia, Altadena*"},{"$f":"IF(ISBLANK('FY22-23 Work Plan'!$E$7:$E$7),\"\",'FY22-23 Work Plan'!$E$7:$E$7)","v":"Cadillac-Corning, Angeles National Forest"},{"$f":"IF(ISBLANK('FY22-23 Work Plan'!$E$8:$E$8),\"\",'FY22-23 Work Plan'!$E$8:$E$8)","v":"90032, 90036"},{"$f":"IF(ISBLANK('FY22-23 Work Plan'!$E$9:$E$9),\"\",'FY22-23 Work Plan'!$E$9:$E$9)","v":"123 E Main St., Suite 100 \nAnytown, CA 90000"},{"$f":"IF(ISBLANK('FY22-23 Work Plan'!$J$9:$J$9),\"\",TEXT('FY22-23 Work Plan'!$J$9:$J$9,\"###-###-####\"))","v":"999-999-9999"},{"$f":"IF(ISBLANK('FY22-23 Work Plan'!$J$10:$J$10),\"\",'FY22-23 Work Plan'!$J$10:$J$10)","v":"www.abc1.org"},{"$f":"IF(ISBLANK('FY22-23 Work Plan'!$E$11:$E$11),\"\",'FY22-23 Work Plan'!$E$11:$E$11)","v":"123 E Main St., Suite 100 \nAnytown, CA 90000"},{"$f":"IF(ISBLANK('FY22-23 Work Plan'!$J$11:$J$11),\"\",TEXT('FY22-23 Work Plan'!$J$11:$J$11,\"###-###-####\"))","v":"999-999-9999"},{"$f":"IF(ISBLANK('FY22-23 Work Plan'!$J$12:$J$12),\"\",'FY22-23 Work Plan'!$J$12:$J$12)","v":"www.abc2.org"},{"$f":"IF(ISBLANK('FY22-23 Work Plan'!$E$15:$E$15),\"\",'FY22-23 Work Plan'!$E$15:$E$15)","v":"John/Jane Doe"},{"$f":"IF(ISBLANK('FY22-23 Work Plan'!$H$15:$H$15),\"\",TEXT('FY22-23 Work Plan'!$H$15:$H$15,\"###-###-####\"))","v":"213-555-1212"},{"$f":"IF(ISBLANK('FY22-23 Work Plan'!$J$15:$J$15),\"\",'FY22-23 Work Plan'!$J$15:$J$15)","v":"janedoe@preventionusa.com"},{"$f":"IF(ISBLANK('FY22-23 Work Plan'!$E$16:$E$16),\"\",'FY22-23 Work Plan'!$E$16:$E$16)","v":"John/Jane Doe"},{"$f":"IF(ISBLANK('FY22-23 Work Plan'!$H$16:$H$16),\"\",TEXT('FY22-23 Work Plan'!$H$16:$H$16,\"###-###-####\"))","v":"213-555-1212"},{"$f":"IF(ISBLANK('FY22-23 Work Plan'!$J$16:$J$16),\"\",'FY22-23 Work Plan'!$J$16:$J$16)","v":"janedoe@preventionusa.com"},{"$f":"IF(ISBLANK('FY22-23 Work Plan'!$E$17:$E$17),\"\",'FY22-23 Work Plan'!$E$17:$E$17)","v":"John/Jane Doe"},{"$f":"IF(ISBLANK('FY22-23 Work Plan'!$H$17:$H$17),\"\",TEXT('FY22-23 Work Plan'!$H$17:$H$17,\"###-###-####\"))","v":"213-555-1212"},{"$f":"IF(ISBLANK('FY22-23 Work Plan'!$J$17:$J$17),\"\",'FY22-23 Work Plan'!$J$17:$J$17)","v":"j.doe@preventionusa.com"},{"$f":"IF(ISBLANK('FY22-23 Work Plan'!$E$18:$E$18),\"\",'FY22-23 Work Plan'!$E$18:$E$18)","v":"John/Jane Doe"},{"$f":"IF(ISBLANK('FY22-23 Work Plan'!$H$18:$H$18),\"\",TEXT('FY22-23 Work Plan'!$H$18:$H$18,\"###-###-####\"))","v":"213-555-1213"},{"$f":"IF(ISBLANK('FY22-23 Work Plan'!$J$18:$J$18),\"\",'FY22-23 Work Plan'!$J$18:$J$18)","v":"j.doe@preventionusa.com"},{"$f":"IF(ISBLANK('FY22-23 Work Plan'!$E$19:$E$19),\"\",'FY22-23 Work Plan'!$E$19:$E$19)","v":"John/Jane Doe"},{"$f":"IF(ISBLANK('FY22-23 Work Plan'!$H$19:$H$19),\"\",TEXT('FY22-23 Work Plan'!$H$19:$H$19,\"###-###-####\"))","v":"213-555-1213"},{"$f":"IF(ISBLANK('FY22-23 Work Plan'!$J$19:$J$19),\"\",'FY22-23 Work Plan'!$J$19:$J$19)","v":"j.doe@preventionusa.com"},{"$f":"IF(ISBLANK('FY22-23 Work Plan'!$D$23:$D$23),\"\",'FY22-23 Work Plan'!$D$23:$D$23)","v":""},{"$f":"IF(ISBLANK('FY22-23 Work Plan'!$H$23:$H$23),\"\",'FY22-23 Work Plan'!$H$23:$H$23)","v":""},{"$f":"IF(ISBLANK('FY22-23 Work Plan'!$D$24:$D$24),\"\",'FY22-23 Work Plan'!$D$24:$D$24)","v":""},{"$f":"IF(ISBLANK('FY22-23 Work Plan'!$H$24:$H$24),\"\",'FY22-23 Work Plan'!$H$24:$H$24)","v":""},{"$f":"IF(ISBLANK('FY22-23 Work Plan'!$D$25:$D$25),\"\",'FY22-23 Work Plan'!$D$25:$D$25)","v":""},{"$f":"IF(ISBLANK('FY22-23 Work Plan'!$H$25:$H$25),\"\",'FY22-23 Work Plan'!$H$25:$H$25)","v":""},{"$f":"IF(ISBLANK('FY22-23 Work Plan'!$D$26:$D$26),\"\",'FY22-23 Work Plan'!$D$26:$D$26)","v":""},{"$f":"IF(ISBLANK('FY22-23 Work Plan'!$H$26:$H$26),\"\",'FY22-23 Work Plan'!$H$26:$H$26)","v":""},{"$f":"IF(ISBLANK('FY22-23 Work Plan'!$D$27:$D$27),\"\",'FY22-23 Work Plan'!$D$27:$D$27)","v":""},{"$f":"IF(ISBLANK('FY22-23 Work Plan'!$H$27:$H$27),\"\",'FY22-23 Work Plan'!$H$27:$H$27)","v":""},{"$f":"IF(ISBLANK('FY22-23 Work Plan'!$D$28:$D$28),\"\",'FY22-23 Work Plan'!$D$28:$D$28)","v":""},{"$f":"IF(ISBLANK('FY22-23 Work Plan'!$H$28:$H$28),\"\",'FY22-23 Work Plan'!$H$28:$H$28)","v":""},{"$f":"IF(ISBLANK('FY22-23 Work Plan'!$D$29:$D$29),\"\",'FY22-23 Work Plan'!$D$29:$D$29)","v":""},{"$f":"IF(ISBLANK('FY22-23 Work Plan'!$H$29:$H$29),\"\",'FY22-23 Work Plan'!$H$29:$H$29)","v":""},{"$f":"IF(ISBLANK('FY22-23 Work Plan'!$B$30:$B$30),\"\",'FY22-23 Work Plan'!$B$30:$B$30)","v":""},{"$f":"IF(ISBLANK('FY22-23 Work Plan'!$D$30:$D$30),\"\",'FY22-23 Work Plan'!$D$30:$D$30)","v":""},{"$f":"IF(ISBLANK('FY22-23 Work Plan'!$H$30:$H$30),\"\",'FY22-23 Work Plan'!$H$30:$H$30)","v":""},{"$f":"IF(ISBLANK('FY22-23 Work Plan'!$B$31:$B$31),\"\",'FY22-23 Work Plan'!$B$31:$B$31)","v":""},{"$f":"IF(ISBLANK('FY22-23 Work Plan'!$D$31:$D$31),\"\",'FY22-23 Work Plan'!$D$31:$D$31)","v":""},{"$f":"IF(ISBLANK('FY22-23 Work Plan'!$H$31:$H$31),\"\",'FY22-23 Work Plan'!$H$31:$H$31)","v":""},{"$f":"IF(ISBLANK('FY22-23 Work Plan'!$B$32:$B$32),\"\",'FY22-23 Work Plan'!$B$32:$B$32)","v":""},{"$f":"IF(ISBLANK('FY22-23 Work Plan'!$D$32:$D$32),\"\",'FY22-23 Work Plan'!$D$32:$D$32)","v":""},{"$f":"IF(ISBLANK('FY22-23 Work Plan'!$H$32:$H$32),\"\",'FY22-23 Work Plan'!$H$32:$H$32)","v":""},{"$f":"IF(ISBLANK('FY22-23 Work Plan'!A81),\"\",'FY22-23 Work Plan'!A81)","v":""},{"$f":"IF(ISBLANK('FY22-23 Work Plan'!D81),\"\",'FY22-23 Work Plan'!D81)","v":""},{"$f":"IF(ISBLANK('FY22-23 Work Plan'!E81),\"\",'FY22-23 Work Plan'!E81)","v":""},{"$f":"IF(ISBLANK('FY22-23 Work Plan'!F81),\"\",'FY22-23 Work Plan'!F81)","v":""},{"$f":"IF(ISBLANK('FY22-23 Work Plan'!H81),\"\",'FY22-23 Work Plan'!H81)","v":""},{"$f":"IF(ISBLANK('FY22-23 Work Plan'!I81),\"\",'FY22-23 Work Plan'!I81)","v":""},{"$f":"IF(ISBLANK('FY22-23 Work Plan'!J81),\"\",'FY22-23 Work Plan'!J81)","v":""},{"$f":"IF(ISBLANK('FY22-23 Work Plan'!K81),\"\",'FY22-23 Work Plan'!K81)","v":""},{"$f":"IF(ISBLANK('FY22-23 Work Plan'!L81),\"\",'FY22-23 Work Plan'!L81)","v":""}]
[{"$f":"IF(ISBLANK('FY22-23 Work Plan'!$E$2:$E$2),\"\",'FY22-23 Work Plan'!$E$2:$E$2)","v":"Asian American Drug Abuse Programs, Inc. (AADAP)"},{"$f":"IF(ISBLANK('FY22-23 Work Plan'!$J$2:$J$2),\"\",'FY22-23 Work Plan'!$J$2:$J$2)","v":"Prevention Education Program (PEP)"},{"$f":"IF(ISBLANK('FY22-23 Work Plan'!$J$3:$J$3),\"\",'FY22-23 Work Plan'!$J$3:$J$3)","v":""},{"$f":"IF(ISBLANK('FY22-23 Work Plan'!$E$3:$E$3),\"\",'FY22-23 Work Plan'!$E$3:$E$3)","v":"PH-004367"},{"$f":"IF(ISBLANK('FY22-23 Work Plan'!$E$4:$E$4),\"\",TEXT('FY22-23 Work Plan'!$E$4:$E$4,\"000000\"))","v":"000001"},{"$f":"IF(ISBLANK('FY22-23 Work Plan'!$J$4:$J$4),\"\",'FY22-23 Work Plan'!$J$4:$J$4)","v":"Building Skills"},{"$f":"IF(ISBLANK('FY22-23 Work Plan'!$E$5:$E$5),\"\",'FY22-23 Work Plan'!$E$5:$E$5)","v":"2 - San Fernando Valley"},{"$f":"IF(ISBLANK('FY22-23 Work Plan'!$J$5:$J$5),\"\",'FY22-23 Work Plan'!$J$5:$J$5)","v":"3rd District, 4th District"},{"$f":"IF(ISBLANK('FY22-23 Work Plan'!$E$6:$E$6),\"\",'FY22-23 Work Plan'!$E$6:$E$6)","v":"Angeles National Forest*, Artesia, Altadena*"},{"$f":"IF(ISBLANK('FY22-23 Work Plan'!$E$7:$E$7),\"\",'FY22-23 Work Plan'!$E$7:$E$7)","v":"Cadillac-Corning, Angeles National Forest"},{"$f":"IF(ISBLANK('FY22-23 Work Plan'!$E$8:$E$8),\"\",'FY22-23 Work Plan'!$E$8:$E$8)","v":"90032, 90036"},{"$f":"IF(ISBLANK('FY22-23 Work Plan'!$E$9:$E$9),\"\",'FY22-23 Work Plan'!$E$9:$E$9)","v":"123 E Main St., Suite 100 \nAnytown, CA 90000"},{"$f":"IF(ISBLANK('FY22-23 Work Plan'!$J$9:$J$9),\"\",TEXT('FY22-23 Work Plan'!$J$9:$J$9,\"###-###-####\"))","v":"999-999-9999"},{"$f":"IF(ISBLANK('FY22-23 Work Plan'!$J$10:$J$10),\"\",'FY22-23 Work Plan'!$J$10:$J$10)","v":"www.abc1.org"},{"$f":"IF(ISBLANK('FY22-23 Work Plan'!$E$11:$E$11),\"\",'FY22-23 Work Plan'!$E$11:$E$11)","v":"123 E Main St., Suite 100 \nAnytown, CA 90000"},{"$f":"IF(ISBLANK('FY22-23 Work Plan'!$J$11:$J$11),\"\",TEXT('FY22-23 Work Plan'!$J$11:$J$11,\"###-###-####\"))","v":"999-999-9999"},{"$f":"IF(ISBLANK('FY22-23 Work Plan'!$J$12:$J$12),\"\",'FY22-23 Work Plan'!$J$12:$J$12)","v":"www.abc2.org"},{"$f":"IF(ISBLANK('FY22-23 Work Plan'!$E$15:$E$15),\"\",'FY22-23 Work Plan'!$E$15:$E$15)","v":"John/Jane Doe"},{"$f":"IF(ISBLANK('FY22-23 Work Plan'!$H$15:$H$15),\"\",TEXT('FY22-23 Work Plan'!$H$15:$H$15,\"###-###-####\"))","v":"213-555-1212"},{"$f":"IF(ISBLANK('FY22-23 Work Plan'!$J$15:$J$15),\"\",'FY22-23 Work Plan'!$J$15:$J$15)","v":"janedoe@preventionusa.com"},{"$f":"IF(ISBLANK('FY22-23 Work Plan'!$E$16:$E$16),\"\",'FY22-23 Work Plan'!$E$16:$E$16)","v":"John/Jane Doe"},{"$f":"IF(ISBLANK('FY22-23 Work Plan'!$H$16:$H$16),\"\",TEXT('FY22-23 Work Plan'!$H$16:$H$16,\"###-###-####\"))","v":"213-555-1212"},{"$f":"IF(ISBLANK('FY22-23 Work Plan'!$J$16:$J$16),\"\",'FY22-23 Work Plan'!$J$16:$J$16)","v":"janedoe@preventionusa.com"},{"$f":"IF(ISBLANK('FY22-23 Work Plan'!$E$17:$E$17),\"\",'FY22-23 Work Plan'!$E$17:$E$17)","v":"John/Jane Doe"},{"$f":"IF(ISBLANK('FY22-23 Work Plan'!$H$17:$H$17),\"\",TEXT('FY22-23 Work Plan'!$H$17:$H$17,\"###-###-####\"))","v":"213-555-1212"},{"$f":"IF(ISBLANK('FY22-23 Work Plan'!$J$17:$J$17),\"\",'FY22-23 Work Plan'!$J$17:$J$17)","v":"j.doe@preventionusa.com"},{"$f":"IF(ISBLANK('FY22-23 Work Plan'!$E$18:$E$18),\"\",'FY22-23 Work Plan'!$E$18:$E$18)","v":"John/Jane Doe"},{"$f":"IF(ISBLANK('FY22-23 Work Plan'!$H$18:$H$18),\"\",TEXT('FY22-23 Work Plan'!$H$18:$H$18,\"###-###-####\"))","v":"213-555-1213"},{"$f":"IF(ISBLANK('FY22-23 Work Plan'!$J$18:$J$18),\"\",'FY22-23 Work Plan'!$J$18:$J$18)","v":"j.doe@preventionusa.com"},{"$f":"IF(ISBLANK('FY22-23 Work Plan'!$E$19:$E$19),\"\",'FY22-23 Work Plan'!$E$19:$E$19)","v":"John/Jane Doe"},{"$f":"IF(ISBLANK('FY22-23 Work Plan'!$H$19:$H$19),\"\",TEXT('FY22-23 Work Plan'!$H$19:$H$19,\"###-###-####\"))","v":"213-555-1213"},{"$f":"IF(ISBLANK('FY22-23 Work Plan'!$J$19:$J$19),\"\",'FY22-23 Work Plan'!$J$19:$J$19)","v":"j.doe@preventionusa.com"},{"$f":"IF(ISBLANK('FY22-23 Work Plan'!$D$23:$D$23),\"\",'FY22-23 Work Plan'!$D$23:$D$23)","v":""},{"$f":"IF(ISBLANK('FY22-23 Work Plan'!$H$23:$H$23),\"\",'FY22-23 Work Plan'!$H$23:$H$23)","v":""},{"$f":"IF(ISBLANK('FY22-23 Work Plan'!$D$24:$D$24),\"\",'FY22-23 Work Plan'!$D$24:$D$24)","v":""},{"$f":"IF(ISBLANK('FY22-23 Work Plan'!$H$24:$H$24),\"\",'FY22-23 Work Plan'!$H$24:$H$24)","v":""},{"$f":"IF(ISBLANK('FY22-23 Work Plan'!$D$25:$D$25),\"\",'FY22-23 Work Plan'!$D$25:$D$25)","v":""},{"$f":"IF(ISBLANK('FY22-23 Work Plan'!$H$25:$H$25),\"\",'FY22-23 Work Plan'!$H$25:$H$25)","v":""},{"$f":"IF(ISBLANK('FY22-23 Work Plan'!$D$26:$D$26),\"\",'FY22-23 Work Plan'!$D$26:$D$26)","v":""},{"$f":"IF(ISBLANK('FY22-23 Work Plan'!$H$26:$H$26),\"\",'FY22-23 Work Plan'!$H$26:$H$26)","v":""},{"$f":"IF(ISBLANK('FY22-23 Work Plan'!$D$27:$D$27),\"\",'FY22-23 Work Plan'!$D$27:$D$27)","v":""},{"$f":"IF(ISBLANK('FY22-23 Work Plan'!$H$27:$H$27),\"\",'FY22-23 Work Plan'!$H$27:$H$27)","v":""},{"$f":"IF(ISBLANK('FY22-23 Work Plan'!$D$28:$D$28),\"\",'FY22-23 Work Plan'!$D$28:$D$28)","v":""},{"$f":"IF(ISBLANK('FY22-23 Work Plan'!$H$28:$H$28),\"\",'FY22-23 Work Plan'!$H$28:$H$28)","v":""},{"$f":"IF(ISBLANK('FY22-23 Work Plan'!$D$29:$D$29),\"\",'FY22-23 Work Plan'!$D$29:$D$29)","v":""},{"$f":"IF(ISBLANK('FY22-23 Work Plan'!$H$29:$H$29),\"\",'FY22-23 Work Plan'!$H$29:$H$29)","v":""},{"$f":"IF(ISBLANK('FY22-23 Work Plan'!$B$30:$B$30),\"\",'FY22-23 Work Plan'!$B$30:$B$30)","v":""},{"$f":"IF(ISBLANK('FY22-23 Work Plan'!$D$30:$D$30),\"\",'FY22-23 Work Plan'!$D$30:$D$30)","v":""},{"$f":"IF(ISBLANK('FY22-23 Work Plan'!$H$30:$H$30),\"\",'FY22-23 Work Plan'!$H$30:$H$30)","v":""},{"$f":"IF(ISBLANK('FY22-23 Work Plan'!$B$31:$B$31),\"\",'FY22-23 Work Plan'!$B$31:$B$31)","v":""},{"$f":"IF(ISBLANK('FY22-23 Work Plan'!$D$31:$D$31),\"\",'FY22-23 Work Plan'!$D$31:$D$31)","v":""},{"$f":"IF(ISBLANK('FY22-23 Work Plan'!$H$31:$H$31),\"\",'FY22-23 Work Plan'!$H$31:$H$31)","v":""},{"$f":"IF(ISBLANK('FY22-23 Work Plan'!$B$32:$B$32),\"\",'FY22-23 Work Plan'!$B$32:$B$32)","v":""},{"$f":"IF(ISBLANK('FY22-23 Work Plan'!$D$32:$D$32),\"\",'FY22-23 Work Plan'!$D$32:$D$32)","v":""},{"$f":"IF(ISBLANK('FY22-23 Work Plan'!$H$32:$H$32),\"\",'FY22-23 Work Plan'!$H$32:$H$32)","v":""},{"$f":"IF(ISBLANK('FY22-23 Work Plan'!A82),\"\",'FY22-23 Work Plan'!A82)","v":""},{"$f":"IF(ISBLANK('FY22-23 Work Plan'!D82),\"\",'FY22-23 Work Plan'!D82)","v":""},{"$f":"IF(ISBLANK('FY22-23 Work Plan'!E82),\"\",'FY22-23 Work Plan'!E82)","v":""},{"$f":"IF(ISBLANK('FY22-23 Work Plan'!F82),\"\",'FY22-23 Work Plan'!F82)","v":""},{"$f":"IF(ISBLANK('FY22-23 Work Plan'!H82),\"\",'FY22-23 Work Plan'!H82)","v":""},{"$f":"IF(ISBLANK('FY22-23 Work Plan'!I82),\"\",'FY22-23 Work Plan'!I82)","v":""},{"$f":"IF(ISBLANK('FY22-23 Work Plan'!J82),\"\",'FY22-23 Work Plan'!J82)","v":""},{"$f":"IF(ISBLANK('FY22-23 Work Plan'!K82),\"\",'FY22-23 Work Plan'!K82)","v":""},{"$f":"IF(ISBLANK('FY22-23 Work Plan'!L82),\"\",'FY22-23 Work Plan'!L82)","v":""}]
[{"$f":"IF(ISBLANK('FY22-23 Work Plan'!$E$2:$E$2),\"\",'FY22-23 Work Plan'!$E$2:$E$2)","v":"Asian American Drug Abuse Programs, Inc. (AADAP)"},{"$f":"IF(ISBLANK('FY22-23 Work Plan'!$J$2:$J$2),\"\",'FY22-23 Work Plan'!$J$2:$J$2)","v":"Prevention Education Program (PEP)"},{"$f":"IF(ISBLANK('FY22-23 Work Plan'!$J$3:$J$3),\"\",'FY22-23 Work Plan'!$J$3:$J$3)","v":""},{"$f":"IF(ISBLANK('FY22-23 Work Plan'!$E$3:$E$3),\"\",'FY22-23 Work Plan'!$E$3:$E$3)","v":"PH-004367"},{"$f":"IF(ISBLANK('FY22-23 Work Plan'!$E$4:$E$4),\"\",TEXT('FY22-23 Work Plan'!$E$4:$E$4,\"000000\"))","v":"000001"},{"$f":"IF(ISBLANK('FY22-23 Work Plan'!$J$4:$J$4),\"\",'FY22-23 Work Plan'!$J$4:$J$4)","v":"Building Skills"},{"$f":"IF(ISBLANK('FY22-23 Work Plan'!$E$5:$E$5),\"\",'FY22-23 Work Plan'!$E$5:$E$5)","v":"2 - San Fernando Valley"},{"$f":"IF(ISBLANK('FY22-23 Work Plan'!$J$5:$J$5),\"\",'FY22-23 Work Plan'!$J$5:$J$5)","v":"3rd District, 4th District"},{"$f":"IF(ISBLANK('FY22-23 Work Plan'!$E$6:$E$6),\"\",'FY22-23 Work Plan'!$E$6:$E$6)","v":"Angeles National Forest*, Artesia, Altadena*"},{"$f":"IF(ISBLANK('FY22-23 Work Plan'!$E$7:$E$7),\"\",'FY22-23 Work Plan'!$E$7:$E$7)","v":"Cadillac-Corning, Angeles National Forest"},{"$f":"IF(ISBLANK('FY22-23 Work Plan'!$E$8:$E$8),\"\",'FY22-23 Work Plan'!$E$8:$E$8)","v":"90032, 90036"},{"$f":"IF(ISBLANK('FY22-23 Work Plan'!$E$9:$E$9),\"\",'FY22-23 Work Plan'!$E$9:$E$9)","v":"123 E Main St., Suite 100 \nAnytown, CA 90000"},{"$f":"IF(ISBLANK('FY22-23 Work Plan'!$J$9:$J$9),\"\",TEXT('FY22-23 Work Plan'!$J$9:$J$9,\"###-###-####\"))","v":"999-999-9999"},{"$f":"IF(ISBLANK('FY22-23 Work Plan'!$J$10:$J$10),\"\",'FY22-23 Work Plan'!$J$10:$J$10)","v":"www.abc1.org"},{"$f":"IF(ISBLANK('FY22-23 Work Plan'!$E$11:$E$11),\"\",'FY22-23 Work Plan'!$E$11:$E$11)","v":"123 E Main St., Suite 100 \nAnytown, CA 90000"},{"$f":"IF(ISBLANK('FY22-23 Work Plan'!$J$11:$J$11),\"\",TEXT('FY22-23 Work Plan'!$J$11:$J$11,\"###-###-####\"))","v":"999-999-9999"},{"$f":"IF(ISBLANK('FY22-23 Work Plan'!$J$12:$J$12),\"\",'FY22-23 Work Plan'!$J$12:$J$12)","v":"www.abc2.org"},{"$f":"IF(ISBLANK('FY22-23 Work Plan'!$E$15:$E$15),\"\",'FY22-23 Work Plan'!$E$15:$E$15)","v":"John/Jane Doe"},{"$f":"IF(ISBLANK('FY22-23 Work Plan'!$H$15:$H$15),\"\",TEXT('FY22-23 Work Plan'!$H$15:$H$15,\"###-###-####\"))","v":"213-555-1212"},{"$f":"IF(ISBLANK('FY22-23 Work Plan'!$J$15:$J$15),\"\",'FY22-23 Work Plan'!$J$15:$J$15)","v":"janedoe@preventionusa.com"},{"$f":"IF(ISBLANK('FY22-23 Work Plan'!$E$16:$E$16),\"\",'FY22-23 Work Plan'!$E$16:$E$16)","v":"John/Jane Doe"},{"$f":"IF(ISBLANK('FY22-23 Work Plan'!$H$16:$H$16),\"\",TEXT('FY22-23 Work Plan'!$H$16:$H$16,\"###-###-####\"))","v":"213-555-1212"},{"$f":"IF(ISBLANK('FY22-23 Work Plan'!$J$16:$J$16),\"\",'FY22-23 Work Plan'!$J$16:$J$16)","v":"janedoe@preventionusa.com"},{"$f":"IF(ISBLANK('FY22-23 Work Plan'!$E$17:$E$17),\"\",'FY22-23 Work Plan'!$E$17:$E$17)","v":"John/Jane Doe"},{"$f":"IF(ISBLANK('FY22-23 Work Plan'!$H$17:$H$17),\"\",TEXT('FY22-23 Work Plan'!$H$17:$H$17,\"###-###-####\"))","v":"213-555-1212"},{"$f":"IF(ISBLANK('FY22-23 Work Plan'!$J$17:$J$17),\"\",'FY22-23 Work Plan'!$J$17:$J$17)","v":"j.doe@preventionusa.com"},{"$f":"IF(ISBLANK('FY22-23 Work Plan'!$E$18:$E$18),\"\",'FY22-23 Work Plan'!$E$18:$E$18)","v":"John/Jane Doe"},{"$f":"IF(ISBLANK('FY22-23 Work Plan'!$H$18:$H$18),\"\",TEXT('FY22-23 Work Plan'!$H$18:$H$18,\"###-###-####\"))","v":"213-555-1213"},{"$f":"IF(ISBLANK('FY22-23 Work Plan'!$J$18:$J$18),\"\",'FY22-23 Work Plan'!$J$18:$J$18)","v":"j.doe@preventionusa.com"},{"$f":"IF(ISBLANK('FY22-23 Work Plan'!$E$19:$E$19),\"\",'FY22-23 Work Plan'!$E$19:$E$19)","v":"John/Jane Doe"},{"$f":"IF(ISBLANK('FY22-23 Work Plan'!$H$19:$H$19),\"\",TEXT('FY22-23 Work Plan'!$H$19:$H$19,\"###-###-####\"))","v":"213-555-1213"},{"$f":"IF(ISBLANK('FY22-23 Work Plan'!$J$19:$J$19),\"\",'FY22-23 Work Plan'!$J$19:$J$19)","v":"j.doe@preventionusa.com"},{"$f":"IF(ISBLANK('FY22-23 Work Plan'!$D$23:$D$23),\"\",'FY22-23 Work Plan'!$D$23:$D$23)","v":""},{"$f":"IF(ISBLANK('FY22-23 Work Plan'!$H$23:$H$23),\"\",'FY22-23 Work Plan'!$H$23:$H$23)","v":""},{"$f":"IF(ISBLANK('FY22-23 Work Plan'!$D$24:$D$24),\"\",'FY22-23 Work Plan'!$D$24:$D$24)","v":""},{"$f":"IF(ISBLANK('FY22-23 Work Plan'!$H$24:$H$24),\"\",'FY22-23 Work Plan'!$H$24:$H$24)","v":""},{"$f":"IF(ISBLANK('FY22-23 Work Plan'!$D$25:$D$25),\"\",'FY22-23 Work Plan'!$D$25:$D$25)","v":""},{"$f":"IF(ISBLANK('FY22-23 Work Plan'!$H$25:$H$25),\"\",'FY22-23 Work Plan'!$H$25:$H$25)","v":""},{"$f":"IF(ISBLANK('FY22-23 Work Plan'!$D$26:$D$26),\"\",'FY22-23 Work Plan'!$D$26:$D$26)","v":""},{"$f":"IF(ISBLANK('FY22-23 Work Plan'!$H$26:$H$26),\"\",'FY22-23 Work Plan'!$H$26:$H$26)","v":""},{"$f":"IF(ISBLANK('FY22-23 Work Plan'!$D$27:$D$27),\"\",'FY22-23 Work Plan'!$D$27:$D$27)","v":""},{"$f":"IF(ISBLANK('FY22-23 Work Plan'!$H$27:$H$27),\"\",'FY22-23 Work Plan'!$H$27:$H$27)","v":""},{"$f":"IF(ISBLANK('FY22-23 Work Plan'!$D$28:$D$28),\"\",'FY22-23 Work Plan'!$D$28:$D$28)","v":""},{"$f":"IF(ISBLANK('FY22-23 Work Plan'!$H$28:$H$28),\"\",'FY22-23 Work Plan'!$H$28:$H$28)","v":""},{"$f":"IF(ISBLANK('FY22-23 Work Plan'!$D$29:$D$29),\"\",'FY22-23 Work Plan'!$D$29:$D$29)","v":""},{"$f":"IF(ISBLANK('FY22-23 Work Plan'!$H$29:$H$29),\"\",'FY22-23 Work Plan'!$H$29:$H$29)","v":""},{"$f":"IF(ISBLANK('FY22-23 Work Plan'!$B$30:$B$30),\"\",'FY22-23 Work Plan'!$B$30:$B$30)","v":""},{"$f":"IF(ISBLANK('FY22-23 Work Plan'!$D$30:$D$30),\"\",'FY22-23 Work Plan'!$D$30:$D$30)","v":""},{"$f":"IF(ISBLANK('FY22-23 Work Plan'!$H$30:$H$30),\"\",'FY22-23 Work Plan'!$H$30:$H$30)","v":""},{"$f":"IF(ISBLANK('FY22-23 Work Plan'!$B$31:$B$31),\"\",'FY22-23 Work Plan'!$B$31:$B$31)","v":""},{"$f":"IF(ISBLANK('FY22-23 Work Plan'!$D$31:$D$31),\"\",'FY22-23 Work Plan'!$D$31:$D$31)","v":""},{"$f":"IF(ISBLANK('FY22-23 Work Plan'!$H$31:$H$31),\"\",'FY22-23 Work Plan'!$H$31:$H$31)","v":""},{"$f":"IF(ISBLANK('FY22-23 Work Plan'!$B$32:$B$32),\"\",'FY22-23 Work Plan'!$B$32:$B$32)","v":""},{"$f":"IF(ISBLANK('FY22-23 Work Plan'!$D$32:$D$32),\"\",'FY22-23 Work Plan'!$D$32:$D$32)","v":""},{"$f":"IF(ISBLANK('FY22-23 Work Plan'!$H$32:$H$32),\"\",'FY22-23 Work Plan'!$H$32:$H$32)","v":""},{"$f":"IF(ISBLANK('FY22-23 Work Plan'!A83),\"\",'FY22-23 Work Plan'!A83)","v":""},{"$f":"IF(ISBLANK('FY22-23 Work Plan'!D83),\"\",'FY22-23 Work Plan'!D83)","v":""},{"$f":"IF(ISBLANK('FY22-23 Work Plan'!E83),\"\",'FY22-23 Work Plan'!E83)","v":""},{"$f":"IF(ISBLANK('FY22-23 Work Plan'!F83),\"\",'FY22-23 Work Plan'!F83)","v":""},{"$f":"IF(ISBLANK('FY22-23 Work Plan'!H83),\"\",'FY22-23 Work Plan'!H83)","v":""},{"$f":"IF(ISBLANK('FY22-23 Work Plan'!I83),\"\",'FY22-23 Work Plan'!I83)","v":""},{"$f":"IF(ISBLANK('FY22-23 Work Plan'!J83),\"\",'FY22-23 Work Plan'!J83)","v":""},{"$f":"IF(ISBLANK('FY22-23 Work Plan'!K83),\"\",'FY22-23 Work Plan'!K83)","v":""},{"$f":"IF(ISBLANK('FY22-23 Work Plan'!L83),\"\",'FY22-23 Work Plan'!L83)","v":""}]
[{"$f":"IF(ISBLANK('FY22-23 Work Plan'!$E$2:$E$2),\"\",'FY22-23 Work Plan'!$E$2:$E$2)","v":"Asian American Drug Abuse Programs, Inc. (AADAP)"},{"$f":"IF(ISBLANK('FY22-23 Work Plan'!$J$2:$J$2),\"\",'FY22-23 Work Plan'!$J$2:$J$2)","v":"Prevention Education Program (PEP)"},{"$f":"IF(ISBLANK('FY22-23 Work Plan'!$J$3:$J$3),\"\",'FY22-23 Work Plan'!$J$3:$J$3)","v":""},{"$f":"IF(ISBLANK('FY22-23 Work Plan'!$E$3:$E$3),\"\",'FY22-23 Work Plan'!$E$3:$E$3)","v":"PH-004367"},{"$f":"IF(ISBLANK('FY22-23 Work Plan'!$E$4:$E$4),\"\",TEXT('FY22-23 Work Plan'!$E$4:$E$4,\"000000\"))","v":"000001"},{"$f":"IF(ISBLANK('FY22-23 Work Plan'!$J$4:$J$4),\"\",'FY22-23 Work Plan'!$J$4:$J$4)","v":"Building Skills"},{"$f":"IF(ISBLANK('FY22-23 Work Plan'!$E$5:$E$5),\"\",'FY22-23 Work Plan'!$E$5:$E$5)","v":"2 - San Fernando Valley"},{"$f":"IF(ISBLANK('FY22-23 Work Plan'!$J$5:$J$5),\"\",'FY22-23 Work Plan'!$J$5:$J$5)","v":"3rd District, 4th District"},{"$f":"IF(ISBLANK('FY22-23 Work Plan'!$E$6:$E$6),\"\",'FY22-23 Work Plan'!$E$6:$E$6)","v":"Angeles National Forest*, Artesia, Altadena*"},{"$f":"IF(ISBLANK('FY22-23 Work Plan'!$E$7:$E$7),\"\",'FY22-23 Work Plan'!$E$7:$E$7)","v":"Cadillac-Corning, Angeles National Forest"},{"$f":"IF(ISBLANK('FY22-23 Work Plan'!$E$8:$E$8),\"\",'FY22-23 Work Plan'!$E$8:$E$8)","v":"90032, 90036"},{"$f":"IF(ISBLANK('FY22-23 Work Plan'!$E$9:$E$9),\"\",'FY22-23 Work Plan'!$E$9:$E$9)","v":"123 E Main St., Suite 100 \nAnytown, CA 90000"},{"$f":"IF(ISBLANK('FY22-23 Work Plan'!$J$9:$J$9),\"\",TEXT('FY22-23 Work Plan'!$J$9:$J$9,\"###-###-####\"))","v":"999-999-9999"},{"$f":"IF(ISBLANK('FY22-23 Work Plan'!$J$10:$J$10),\"\",'FY22-23 Work Plan'!$J$10:$J$10)","v":"www.abc1.org"},{"$f":"IF(ISBLANK('FY22-23 Work Plan'!$E$11:$E$11),\"\",'FY22-23 Work Plan'!$E$11:$E$11)","v":"123 E Main St., Suite 100 \nAnytown, CA 90000"},{"$f":"IF(ISBLANK('FY22-23 Work Plan'!$J$11:$J$11),\"\",TEXT('FY22-23 Work Plan'!$J$11:$J$11,\"###-###-####\"))","v":"999-999-9999"},{"$f":"IF(ISBLANK('FY22-23 Work Plan'!$J$12:$J$12),\"\",'FY22-23 Work Plan'!$J$12:$J$12)","v":"www.abc2.org"},{"$f":"IF(ISBLANK('FY22-23 Work Plan'!$E$15:$E$15),\"\",'FY22-23 Work Plan'!$E$15:$E$15)","v":"John/Jane Doe"},{"$f":"IF(ISBLANK('FY22-23 Work Plan'!$H$15:$H$15),\"\",TEXT('FY22-23 Work Plan'!$H$15:$H$15,\"###-###-####\"))","v":"213-555-1212"},{"$f":"IF(ISBLANK('FY22-23 Work Plan'!$J$15:$J$15),\"\",'FY22-23 Work Plan'!$J$15:$J$15)","v":"janedoe@preventionusa.com"},{"$f":"IF(ISBLANK('FY22-23 Work Plan'!$E$16:$E$16),\"\",'FY22-23 Work Plan'!$E$16:$E$16)","v":"John/Jane Doe"},{"$f":"IF(ISBLANK('FY22-23 Work Plan'!$H$16:$H$16),\"\",TEXT('FY22-23 Work Plan'!$H$16:$H$16,\"###-###-####\"))","v":"213-555-1212"},{"$f":"IF(ISBLANK('FY22-23 Work Plan'!$J$16:$J$16),\"\",'FY22-23 Work Plan'!$J$16:$J$16)","v":"janedoe@preventionusa.com"},{"$f":"IF(ISBLANK('FY22-23 Work Plan'!$E$17:$E$17),\"\",'FY22-23 Work Plan'!$E$17:$E$17)","v":"John/Jane Doe"},{"$f":"IF(ISBLANK('FY22-23 Work Plan'!$H$17:$H$17),\"\",TEXT('FY22-23 Work Plan'!$H$17:$H$17,\"###-###-####\"))","v":"213-555-1212"},{"$f":"IF(ISBLANK('FY22-23 Work Plan'!$J$17:$J$17),\"\",'FY22-23 Work Plan'!$J$17:$J$17)","v":"j.doe@preventionusa.com"},{"$f":"IF(ISBLANK('FY22-23 Work Plan'!$E$18:$E$18),\"\",'FY22-23 Work Plan'!$E$18:$E$18)","v":"John/Jane Doe"},{"$f":"IF(ISBLANK('FY22-23 Work Plan'!$H$18:$H$18),\"\",TEXT('FY22-23 Work Plan'!$H$18:$H$18,\"###-###-####\"))","v":"213-555-1213"},{"$f":"IF(ISBLANK('FY22-23 Work Plan'!$J$18:$J$18),\"\",'FY22-23 Work Plan'!$J$18:$J$18)","v":"j.doe@preventionusa.com"},{"$f":"IF(ISBLANK('FY22-23 Work Plan'!$E$19:$E$19),\"\",'FY22-23 Work Plan'!$E$19:$E$19)","v":"John/Jane Doe"},{"$f":"IF(ISBLANK('FY22-23 Work Plan'!$H$19:$H$19),\"\",TEXT('FY22-23 Work Plan'!$H$19:$H$19,\"###-###-####\"))","v":"213-555-1213"},{"$f":"IF(ISBLANK('FY22-23 Work Plan'!$J$19:$J$19),\"\",'FY22-23 Work Plan'!$J$19:$J$19)","v":"j.doe@preventionusa.com"},{"$f":"IF(ISBLANK('FY22-23 Work Plan'!$D$23:$D$23),\"\",'FY22-23 Work Plan'!$D$23:$D$23)","v":""},{"$f":"IF(ISBLANK('FY22-23 Work Plan'!$H$23:$H$23),\"\",'FY22-23 Work Plan'!$H$23:$H$23)","v":""},{"$f":"IF(ISBLANK('FY22-23 Work Plan'!$D$24:$D$24),\"\",'FY22-23 Work Plan'!$D$24:$D$24)","v":""},{"$f":"IF(ISBLANK('FY22-23 Work Plan'!$H$24:$H$24),\"\",'FY22-23 Work Plan'!$H$24:$H$24)","v":""},{"$f":"IF(ISBLANK('FY22-23 Work Plan'!$D$25:$D$25),\"\",'FY22-23 Work Plan'!$D$25:$D$25)","v":""},{"$f":"IF(ISBLANK('FY22-23 Work Plan'!$H$25:$H$25),\"\",'FY22-23 Work Plan'!$H$25:$H$25)","v":""},{"$f":"IF(ISBLANK('FY22-23 Work Plan'!$D$26:$D$26),\"\",'FY22-23 Work Plan'!$D$26:$D$26)","v":""},{"$f":"IF(ISBLANK('FY22-23 Work Plan'!$H$26:$H$26),\"\",'FY22-23 Work Plan'!$H$26:$H$26)","v":""},{"$f":"IF(ISBLANK('FY22-23 Work Plan'!$D$27:$D$27),\"\",'FY22-23 Work Plan'!$D$27:$D$27)","v":""},{"$f":"IF(ISBLANK('FY22-23 Work Plan'!$H$27:$H$27),\"\",'FY22-23 Work Plan'!$H$27:$H$27)","v":""},{"$f":"IF(ISBLANK('FY22-23 Work Plan'!$D$28:$D$28),\"\",'FY22-23 Work Plan'!$D$28:$D$28)","v":""},{"$f":"IF(ISBLANK('FY22-23 Work Plan'!$H$28:$H$28),\"\",'FY22-23 Work Plan'!$H$28:$H$28)","v":""},{"$f":"IF(ISBLANK('FY22-23 Work Plan'!$D$29:$D$29),\"\",'FY22-23 Work Plan'!$D$29:$D$29)","v":""},{"$f":"IF(ISBLANK('FY22-23 Work Plan'!$H$29:$H$29),\"\",'FY22-23 Work Plan'!$H$29:$H$29)","v":""},{"$f":"IF(ISBLANK('FY22-23 Work Plan'!$B$30:$B$30),\"\",'FY22-23 Work Plan'!$B$30:$B$30)","v":""},{"$f":"IF(ISBLANK('FY22-23 Work Plan'!$D$30:$D$30),\"\",'FY22-23 Work Plan'!$D$30:$D$30)","v":""},{"$f":"IF(ISBLANK('FY22-23 Work Plan'!$H$30:$H$30),\"\",'FY22-23 Work Plan'!$H$30:$H$30)","v":""},{"$f":"IF(ISBLANK('FY22-23 Work Plan'!$B$31:$B$31),\"\",'FY22-23 Work Plan'!$B$31:$B$31)","v":""},{"$f":"IF(ISBLANK('FY22-23 Work Plan'!$D$31:$D$31),\"\",'FY22-23 Work Plan'!$D$31:$D$31)","v":""},{"$f":"IF(ISBLANK('FY22-23 Work Plan'!$H$31:$H$31),\"\",'FY22-23 Work Plan'!$H$31:$H$31)","v":""},{"$f":"IF(ISBLANK('FY22-23 Work Plan'!$B$32:$B$32),\"\",'FY22-23 Work Plan'!$B$32:$B$32)","v":""},{"$f":"IF(ISBLANK('FY22-23 Work Plan'!$D$32:$D$32),\"\",'FY22-23 Work Plan'!$D$32:$D$32)","v":""},{"$f":"IF(ISBLANK('FY22-23 Work Plan'!$H$32:$H$32),\"\",'FY22-23 Work Plan'!$H$32:$H$32)","v":""},{"$f":"IF(ISBLANK('FY22-23 Work Plan'!A84),\"\",'FY22-23 Work Plan'!A84)","v":""},{"$f":"IF(ISBLANK('FY22-23 Work Plan'!D84),\"\",'FY22-23 Work Plan'!D84)","v":""},{"$f":"IF(ISBLANK('FY22-23 Work Plan'!E84),\"\",'FY22-23 Work Plan'!E84)","v":""},{"$f":"IF(ISBLANK('FY22-23 Work Plan'!F84),\"\",'FY22-23 Work Plan'!F84)","v":""},{"$f":"IF(ISBLANK('FY22-23 Work Plan'!H84),\"\",'FY22-23 Work Plan'!H84)","v":""},{"$f":"IF(ISBLANK('FY22-23 Work Plan'!I84),\"\",'FY22-23 Work Plan'!I84)","v":""},{"$f":"IF(ISBLANK('FY22-23 Work Plan'!J84),\"\",'FY22-23 Work Plan'!J84)","v":""},{"$f":"IF(ISBLANK('FY22-23 Work Plan'!K84),\"\",'FY22-23 Work Plan'!K84)","v":""},{"$f":"IF(ISBLANK('FY22-23 Work Plan'!L84),\"\",'FY22-23 Work Plan'!L84)","v":""}]
[{"$f":"IF(ISBLANK('FY22-23 Work Plan'!$E$2:$E$2),\"\",'FY22-23 Work Plan'!$E$2:$E$2)","v":"Asian American Drug Abuse Programs, Inc. (AADAP)"},{"$f":"IF(ISBLANK('FY22-23 Work Plan'!$J$2:$J$2),\"\",'FY22-23 Work Plan'!$J$2:$J$2)","v":"Prevention Education Program (PEP)"},{"$f":"IF(ISBLANK('FY22-23 Work Plan'!$J$3:$J$3),\"\",'FY22-23 Work Plan'!$J$3:$J$3)","v":""},{"$f":"IF(ISBLANK('FY22-23 Work Plan'!$E$3:$E$3),\"\",'FY22-23 Work Plan'!$E$3:$E$3)","v":"PH-004367"},{"$f":"IF(ISBLANK('FY22-23 Work Plan'!$E$4:$E$4),\"\",TEXT('FY22-23 Work Plan'!$E$4:$E$4,\"000000\"))","v":"000001"},{"$f":"IF(ISBLANK('FY22-23 Work Plan'!$J$4:$J$4),\"\",'FY22-23 Work Plan'!$J$4:$J$4)","v":"Building Skills"},{"$f":"IF(ISBLANK('FY22-23 Work Plan'!$E$5:$E$5),\"\",'FY22-23 Work Plan'!$E$5:$E$5)","v":"2 - San Fernando Valley"},{"$f":"IF(ISBLANK('FY22-23 Work Plan'!$J$5:$J$5),\"\",'FY22-23 Work Plan'!$J$5:$J$5)","v":"3rd District, 4th District"},{"$f":"IF(ISBLANK('FY22-23 Work Plan'!$E$6:$E$6),\"\",'FY22-23 Work Plan'!$E$6:$E$6)","v":"Angeles National Forest*, Artesia, Altadena*"},{"$f":"IF(ISBLANK('FY22-23 Work Plan'!$E$7:$E$7),\"\",'FY22-23 Work Plan'!$E$7:$E$7)","v":"Cadillac-Corning, Angeles National Forest"},{"$f":"IF(ISBLANK('FY22-23 Work Plan'!$E$8:$E$8),\"\",'FY22-23 Work Plan'!$E$8:$E$8)","v":"90032, 90036"},{"$f":"IF(ISBLANK('FY22-23 Work Plan'!$E$9:$E$9),\"\",'FY22-23 Work Plan'!$E$9:$E$9)","v":"123 E Main St., Suite 100 \nAnytown, CA 90000"},{"$f":"IF(ISBLANK('FY22-23 Work Plan'!$J$9:$J$9),\"\",TEXT('FY22-23 Work Plan'!$J$9:$J$9,\"###-###-####\"))","v":"999-999-9999"},{"$f":"IF(ISBLANK('FY22-23 Work Plan'!$J$10:$J$10),\"\",'FY22-23 Work Plan'!$J$10:$J$10)","v":"www.abc1.org"},{"$f":"IF(ISBLANK('FY22-23 Work Plan'!$E$11:$E$11),\"\",'FY22-23 Work Plan'!$E$11:$E$11)","v":"123 E Main St., Suite 100 \nAnytown, CA 90000"},{"$f":"IF(ISBLANK('FY22-23 Work Plan'!$J$11:$J$11),\"\",TEXT('FY22-23 Work Plan'!$J$11:$J$11,\"###-###-####\"))","v":"999-999-9999"},{"$f":"IF(ISBLANK('FY22-23 Work Plan'!$J$12:$J$12),\"\",'FY22-23 Work Plan'!$J$12:$J$12)","v":"www.abc2.org"},{"$f":"IF(ISBLANK('FY22-23 Work Plan'!$E$15:$E$15),\"\",'FY22-23 Work Plan'!$E$15:$E$15)","v":"John/Jane Doe"},{"$f":"IF(ISBLANK('FY22-23 Work Plan'!$H$15:$H$15),\"\",TEXT('FY22-23 Work Plan'!$H$15:$H$15,\"###-###-####\"))","v":"213-555-1212"},{"$f":"IF(ISBLANK('FY22-23 Work Plan'!$J$15:$J$15),\"\",'FY22-23 Work Plan'!$J$15:$J$15)","v":"janedoe@preventionusa.com"},{"$f":"IF(ISBLANK('FY22-23 Work Plan'!$E$16:$E$16),\"\",'FY22-23 Work Plan'!$E$16:$E$16)","v":"John/Jane Doe"},{"$f":"IF(ISBLANK('FY22-23 Work Plan'!$H$16:$H$16),\"\",TEXT('FY22-23 Work Plan'!$H$16:$H$16,\"###-###-####\"))","v":"213-555-1212"},{"$f":"IF(ISBLANK('FY22-23 Work Plan'!$J$16:$J$16),\"\",'FY22-23 Work Plan'!$J$16:$J$16)","v":"janedoe@preventionusa.com"},{"$f":"IF(ISBLANK('FY22-23 Work Plan'!$E$17:$E$17),\"\",'FY22-23 Work Plan'!$E$17:$E$17)","v":"John/Jane Doe"},{"$f":"IF(ISBLANK('FY22-23 Work Plan'!$H$17:$H$17),\"\",TEXT('FY22-23 Work Plan'!$H$17:$H$17,\"###-###-####\"))","v":"213-555-1212"},{"$f":"IF(ISBLANK('FY22-23 Work Plan'!$J$17:$J$17),\"\",'FY22-23 Work Plan'!$J$17:$J$17)","v":"j.doe@preventionusa.com"},{"$f":"IF(ISBLANK('FY22-23 Work Plan'!$E$18:$E$18),\"\",'FY22-23 Work Plan'!$E$18:$E$18)","v":"John/Jane Doe"},{"$f":"IF(ISBLANK('FY22-23 Work Plan'!$H$18:$H$18),\"\",TEXT('FY22-23 Work Plan'!$H$18:$H$18,\"###-###-####\"))","v":"213-555-1213"},{"$f":"IF(ISBLANK('FY22-23 Work Plan'!$J$18:$J$18),\"\",'FY22-23 Work Plan'!$J$18:$J$18)","v":"j.doe@preventionusa.com"},{"$f":"IF(ISBLANK('FY22-23 Work Plan'!$E$19:$E$19),\"\",'FY22-23 Work Plan'!$E$19:$E$19)","v":"John/Jane Doe"},{"$f":"IF(ISBLANK('FY22-23 Work Plan'!$H$19:$H$19),\"\",TEXT('FY22-23 Work Plan'!$H$19:$H$19,\"###-###-####\"))","v":"213-555-1213"},{"$f":"IF(ISBLANK('FY22-23 Work Plan'!$J$19:$J$19),\"\",'FY22-23 Work Plan'!$J$19:$J$19)","v":"j.doe@preventionusa.com"},{"$f":"IF(ISBLANK('FY22-23 Work Plan'!$D$23:$D$23),\"\",'FY22-23 Work Plan'!$D$23:$D$23)","v":""},{"$f":"IF(ISBLANK('FY22-23 Work Plan'!$H$23:$H$23),\"\",'FY22-23 Work Plan'!$H$23:$H$23)","v":""},{"$f":"IF(ISBLANK('FY22-23 Work Plan'!$D$24:$D$24),\"\",'FY22-23 Work Plan'!$D$24:$D$24)","v":""},{"$f":"IF(ISBLANK('FY22-23 Work Plan'!$H$24:$H$24),\"\",'FY22-23 Work Plan'!$H$24:$H$24)","v":""},{"$f":"IF(ISBLANK('FY22-23 Work Plan'!$D$25:$D$25),\"\",'FY22-23 Work Plan'!$D$25:$D$25)","v":""},{"$f":"IF(ISBLANK('FY22-23 Work Plan'!$H$25:$H$25),\"\",'FY22-23 Work Plan'!$H$25:$H$25)","v":""},{"$f":"IF(ISBLANK('FY22-23 Work Plan'!$D$26:$D$26),\"\",'FY22-23 Work Plan'!$D$26:$D$26)","v":""},{"$f":"IF(ISBLANK('FY22-23 Work Plan'!$H$26:$H$26),\"\",'FY22-23 Work Plan'!$H$26:$H$26)","v":""},{"$f":"IF(ISBLANK('FY22-23 Work Plan'!$D$27:$D$27),\"\",'FY22-23 Work Plan'!$D$27:$D$27)","v":""},{"$f":"IF(ISBLANK('FY22-23 Work Plan'!$H$27:$H$27),\"\",'FY22-23 Work Plan'!$H$27:$H$27)","v":""},{"$f":"IF(ISBLANK('FY22-23 Work Plan'!$D$28:$D$28),\"\",'FY22-23 Work Plan'!$D$28:$D$28)","v":""},{"$f":"IF(ISBLANK('FY22-23 Work Plan'!$H$28:$H$28),\"\",'FY22-23 Work Plan'!$H$28:$H$28)","v":""},{"$f":"IF(ISBLANK('FY22-23 Work Plan'!$D$29:$D$29),\"\",'FY22-23 Work Plan'!$D$29:$D$29)","v":""},{"$f":"IF(ISBLANK('FY22-23 Work Plan'!$H$29:$H$29),\"\",'FY22-23 Work Plan'!$H$29:$H$29)","v":""},{"$f":"IF(ISBLANK('FY22-23 Work Plan'!$B$30:$B$30),\"\",'FY22-23 Work Plan'!$B$30:$B$30)","v":""},{"$f":"IF(ISBLANK('FY22-23 Work Plan'!$D$30:$D$30),\"\",'FY22-23 Work Plan'!$D$30:$D$30)","v":""},{"$f":"IF(ISBLANK('FY22-23 Work Plan'!$H$30:$H$30),\"\",'FY22-23 Work Plan'!$H$30:$H$30)","v":""},{"$f":"IF(ISBLANK('FY22-23 Work Plan'!$B$31:$B$31),\"\",'FY22-23 Work Plan'!$B$31:$B$31)","v":""},{"$f":"IF(ISBLANK('FY22-23 Work Plan'!$D$31:$D$31),\"\",'FY22-23 Work Plan'!$D$31:$D$31)","v":""},{"$f":"IF(ISBLANK('FY22-23 Work Plan'!$H$31:$H$31),\"\",'FY22-23 Work Plan'!$H$31:$H$31)","v":""},{"$f":"IF(ISBLANK('FY22-23 Work Plan'!$B$32:$B$32),\"\",'FY22-23 Work Plan'!$B$32:$B$32)","v":""},{"$f":"IF(ISBLANK('FY22-23 Work Plan'!$D$32:$D$32),\"\",'FY22-23 Work Plan'!$D$32:$D$32)","v":""},{"$f":"IF(ISBLANK('FY22-23 Work Plan'!$H$32:$H$32),\"\",'FY22-23 Work Plan'!$H$32:$H$32)","v":""},{"$f":"IF(ISBLANK('FY22-23 Work Plan'!A85),\"\",'FY22-23 Work Plan'!A85)","v":""},{"$f":"IF(ISBLANK('FY22-23 Work Plan'!D85),\"\",'FY22-23 Work Plan'!D85)","v":""},{"$f":"IF(ISBLANK('FY22-23 Work Plan'!E85),\"\",'FY22-23 Work Plan'!E85)","v":""},{"$f":"IF(ISBLANK('FY22-23 Work Plan'!F85),\"\",'FY22-23 Work Plan'!F85)","v":""},{"$f":"IF(ISBLANK('FY22-23 Work Plan'!H85),\"\",'FY22-23 Work Plan'!H85)","v":""},{"$f":"IF(ISBLANK('FY22-23 Work Plan'!I85),\"\",'FY22-23 Work Plan'!I85)","v":""},{"$f":"IF(ISBLANK('FY22-23 Work Plan'!J85),\"\",'FY22-23 Work Plan'!J85)","v":""},{"$f":"IF(ISBLANK('FY22-23 Work Plan'!K85),\"\",'FY22-23 Work Plan'!K85)","v":""},{"$f":"IF(ISBLANK('FY22-23 Work Plan'!L85),\"\",'FY22-23 Work Plan'!L85)","v":""}]

{"sheet":"Data Validation Instructions","index":4,"n_rows":74,"n_cols":12,"rows_kept":74,"cut":false,"hidden":true,"merged":[]}
["INTERNAL INSTRUCTIONS FOR SAPC: "]
["HOW TO EDIT EXISTING DATA VALIDATIONS (DROP-DOWN LISTS)"]
[]
["Optional: The following website is a great resource for learning about Excel Data Validation."]
["https://exceljet.net/excel-data-validation-guide"]
[]
["1)","Select the cell with the drop-down list.  For this example, cell E2 was selected, which has the drop-down list for Contractor Names."]
[]
[]
[]
[]
[]
["2)","In the toolbar, go to the Data tab and click on Data Validation."]
[]
[]
[]
[]
[]
[]
[]
["3)","In the Data Validation window that pops up, place your mouse cursor in the Source field.  This will take you to the location of your drop-down list, which is in the Data Validation tab, cells H2:H30."]
[]
[]
[]
[]
[]
[]
[]
[]
[]
[]
[]
[]
[]
[]
[]
[]
[]
[]
[]
[]
[]
[]
[]
[]
["4)","Now that you have verified the location/range of your drop-down list, you may edit the drop-down list. "]
[null,"You may modify, add, or delete any of the cells in H2:H30 to make changes to your drop-down list. "]
[null,"If adding or deleting an entry, ensure to update your range in the Source field."]
[]
["5)","In the Data Validation window, you may also edit the Input Message and Error Alert."]
[null,null,"Input Message:",null,null,null,null,null,null,null,null,"Error Alert:"]
[]
[]
[]
[]
[]
[]
[]
[]
[]
[]
[]
[]
[]
[]
[]
[]
[]
[]
[]
[]
[]
[]
["6)","To completely remove the drop-down list from a cell, open the Data Validation window and click on Clear All, then click OK."]